program: Gaussian 16
title: Title
version: AS64L-G16RevC.02
frameworkgroup: C1[X(C6H4BF3)]
method: UB3LYP
basis: def2TZVPP
operation: Freq
keyword: #N
keyword: Geom=AllCheck
keyword: Guess=TCheck
keyword: SCRF=Check
keyword: GenChk
keyword: UB3LYP/def2TZVPP
keyword: Freq
converged: YES YES YES YES
elementType: C
elementType: H
elementType: B
elementType: F
1716.lowfreq: -4.2502 -2.5173 -0.3899 0.0008 0.0009 0.0010 14.7418 110.6609 150.3539
frequency: 14.5584 110.6607 150.3539 276.7811 287.4491 325.4114 409.9537 428.6544 482.5955 542.1046 595.7511 630.3472 675.5902 696.1994 742.7753 879.6784 886.1012 952.0179 953.6234 1005.5518 1024.9024 1032.5295 1054.1964 1088.6587 1159.0384 1174.3999 1282.7194 1292.1444 1418.4180 1469.0619 1533.1948 1610.0138 3121.6949 3151.5418 3163.4866 3165.4894
redmass: 6.5386 7.2514 7.4950 6.8728 9.3485 10.2192 3.7284 7.4114 13.4567 6.0917 11.1049 7.3225 2.3248 9.8412 1.4694 1.3569 1.4022 6.7721 1.4091 4.9769 10.7110 5.8709 2.6093 1.9497 2.2960 1.3202 2.9865 1.6530 2.6567 2.3207 5.0620 6.4924 1.0845 1.0898 1.0887 1.0908
irintensity: 0.2101 0.0459 0.2649 1.8468 6.8098 1.5672 1.2405 2.7683 0.0957 0.3649 8.7048 2.3485 22.2707 1.3144 41.5776 5.1214 23.0067 299.2609 28.3462 38.5949 253.0298 196.3900 8.0169 31.8009 140.0420 54.8620 7.0550 2.3295 2.0447 0.7183 0.8663 1.0319 25.1860 39.4933 31.1247 5.9994
temp: 298.150 k
press: 1.00000 atm
elementType: 6 6 6 6 6 6 1 1 1 1 5 9 9 9
symmnumber: 1
zpe: 232001.7 jmol-1
zpe.correction: 0.088365 hartree
zpe.thermalcorrener: 0.096839 hartree
zpe.thermalcorrenthalpy: 0.097783 hartree
zpe.thermalcorrgfe: 0.052571 hartree
zpe.sumelectzpe: -555.771866 hartree
zpe.sumelectthermal: -555.763392 hartree
zpe.sumelectthermalent: -555.762448 hartree
zpe.sumelectthermalfe: -555.807660 hartree
dipole: 5.0684 -0.6914 -0.0722
dipole: 5.1158
quadrupole: -80.2601 -62.7507 -65.3193
quadrupole: -3.1665 0.0870 -0.0166
quadrupole: -10.8167 6.6927 4.1240 -3.1665 0.0870 -0.0166
hfenergy: -555.8602305 hartree
pointgroup: C01 [X(C6H4B1F3)]
dipole: 1.4489971 1.3926454 0.1094824 debye
dipolederiv: -0.2763934 -0.1041225 0.003749 -0.2233473 -0.2026995 0.013445 0.0215951 0.0299133 -0.1679936 -0.2157965 -0.0929381 -0.005771 0.0938242 0.1010331 0.0119875 0.0066227 0.0121668 -0.0843288 -0.1799605 0.1222147 0.0121436 0.1126988 0.0099837 0.0092108 0.0126738 0.0070603 -0.1594942 -0.0359635 0.0784216 0.0005204 0.0796715 -0.0988788 0.0019596 0.001341 0.0036608 -0.153133 0.1553795 -0.0359961 -0.0145999 -0.0434161 0.1103033 0.0284157 -0.0170391 0.0248545 -0.1798258 0.0120816 -0.0890865 -0.0174597 -0.1801427 -0.1104791 0.0065442 -0.0315005 0.0071384 -0.1348861 0.1155177 0.0359278 0.0001011 0.0428343 -0.0702001 -0.0196885 -0.0002063 -0.0168032 0.1235394 -0.0886731 -0.1184534 0.0000615 -0.1178437 -0.0108693 -0.0088759 -0.0021777 -0.008732 0.1509598 0.0482108 0.0272983 0.0055034 -0.0070357 -0.2265235 -0.029854 0.0039808 -0.0324444 0.1161246 -0.0638726 0.0974484 0.0140985 0.0886293 0.0232029 -0.0150617 0.015789 -0.0177953 0.1216584 1.898418 0.3267368 0.0116208 0.4072886 1.6156852 -0.0034277 0.0348434 0.0083083 1.4670292 -0.7700155 -0.171448 -0.2743828 -0.1623574 -0.506958 -0.0530474 -0.348231 -0.0992596 -0.9655155 -1.0275286 -0.0093315 0.2868959 0.0322454 -0.5285392 -0.1083948 0.3071347 -0.0790526 -0.6522932 -0.5714041 -0.0666713 -0.0224808 -0.1230492 -1.1050607 0.1667872 -0.0048259 0.1609848 -0.4818414 unknown
polarizability: 102.6982149|8.2852328|97.759946|-0.9561415|3.4927526|55.5760061 unknown
InChI: InChI=1/C6H4BF3/c8-7(9,10)6-4-2-1-3-5-6/h1-2,4-5H
charge -1 multiplicity 2
14 atoms
C  -1.78119951 0.313207 0.05818526
C  -0.50383153 -0.27407031 -0.04123671
C  0.59287266 0.54878567 -0.02034372
C  0.57101665 1.91610795 0.09426012
C  -0.69685829 2.50337928 0.19885821
C  -1.83689681 1.70650352 0.18035428
H  -0.42615454 -1.35094762 -0.12229748
H  1.47153265 2.51835658 0.10824338
H  -0.78101464 3.58128385 0.29695573
H  -2.81048464 2.17246487 0.27280928
B  -3.13861761 -0.60464749 -0.00358088
F  -3.6477897 -0.61941218 -1.3280044
F  -4.12866716 -0.0654914 0.85565968
F  -2.85071852 -1.9351567 0.38837125
