program: Gaussian 16
title: Title
version: ES64L-G16RevC.02
frameworkgroup: C1[X(CB11I12)]
method: RB3LYP
basis: def2TZVPP
operation: Freq
keyword: #N
keyword: Geom=AllCheck
keyword: Guess=TCheck
keyword: SCRF=Check
keyword: GenChk
keyword: RB3LYP/def2TZVPP
keyword: Freq
converged: YES YES NO YES
title: Mulliken charges:
elementType: B B B B B B B B B B B I I I I I I I I I I C I I
charge: -0.076658 -0.050579 -0.076551 -0.049399 -0.049631 -0.077050 -0.077142 -0.049549 -0.049515 -0.049458 -0.076672 -0.065662 -0.065534 -0.016459 -0.016447 -0.065516 -0.065544 -0.016444 -0.016444 -0.016468 -0.065636 0.054407 -0.072318 0.110270
chargesum: -1.00000
title: Mulliken charges with hydrogens summed into heavy atoms:
1716.lowfreq: -1.1405 -0.5126 0.0002 0.0003 0.0004 1.9059 54.5081 55.1299 55.1463
frequency: 54.5081 55.1299 55.1463 56.1743 56.1865 63.9993 64.0189 65.1564 65.2006 71.7136 71.7281 71.7598 71.7676 72.1511 77.3574 77.3641 81.4046 81.4120 87.9943 90.3161 90.3406 142.6300 142.6328 145.2688 145.2700 146.5835 148.6980 152.6354 152.6419 159.3988 360.8591 370.6942 370.9947 385.3529 385.3729 393.8664 479.2473 479.3804 547.4019 547.5313 563.2077 633.2416 633.4281 638.4339 638.6890 662.8601 683.7178 683.7942 702.0308 702.1237 732.0252 732.0728 763.9913 764.0817 835.4554 835.5398 854.6627 884.2903 884.4785 894.9917 895.7766 900.0132 922.0832 937.3168 942.6998 942.8252
redmass: 125.7668 124.9133 124.9169 125.5494 125.5476 126.4469 126.4481 126.4071 126.4101 126.3410 126.3933 126.7583 126.7234 123.9474 126.8760 126.8768 99.1709 99.2625 74.7400 86.8680 86.8282 103.2449 103.2433 107.7052 107.6959 111.0696 112.5413 115.4849 115.4871 115.5656 11.1797 11.2532 11.2548 12.8011 12.8018 12.7575 11.0673 11.0676 11.3368 11.3352 11.0180 11.1363 11.1367 11.4047 11.4029 11.2481 11.0273 11.0269 11.1651 11.1648 11.0155 11.0154 11.0096 11.0096 11.1024 11.1024 11.1031 11.0705 11.0703 11.0487 11.0488 11.7600 11.0672 11.1668 11.0812 11.0809
irintensity: 0.0000 0.0000 0.0000 0.0043 0.0044 0.0000 0.0000 0.0014 0.0014 0.0001 0.0002 0.0000 0.0000 0.0001 0.0000 0.0000 0.0171 0.0169 0.2278 0.5328 0.5344 0.0000 0.0000 0.0011 0.0012 0.0099 0.0600 0.0000 0.0000 0.1920 0.0000 0.0037 0.0121 12.7988 12.8094 11.2360 0.0000 0.0001 0.2533 0.2542 0.0000 0.0021 0.0031 3.7111 3.7178 1.3516 0.0000 0.0001 4.2791 4.3057 0.0164 0.0139 0.0001 0.0002 0.0012 0.0038 2.1548 0.2649 0.2161 0.0018 0.0013 0.5464 136.7829 1.2817 216.2560 216.2910
temp: 298.150 k
press: 1.00000 atm
elementType: 5 5 5 5 5 5 5 5 5 5 5 53 53 53 53 53 53 53 53 53 53 6 53 53
symmnumber: 1
zpe: 163895.1 jmol-1
zpe.correction: 0.062424 hartree
zpe.thermalcorrener: 0.092960 hartree
zpe.thermalcorrenthalpy: 0.093904 hartree
zpe.thermalcorrgfe: -0.008422 hartree
zpe.sumelectzpe: -3885.951480 hartree
zpe.sumelectthermal: -3885.920945 hartree
zpe.sumelectthermalent: -3885.920001 hartree
zpe.sumelectthermalfe: -3886.022326 hartree
dipole: 0.0001 0.0028 3.5294
dipole: 3.5294
quadrupole: -424.5147 -424.5121 -415.0921
quadrupole: -0.0002 -0.0007 0.0044
quadrupole: -3.1417 -3.1391 6.2809 -0.0002 -0.0007 0.0044
hfenergy: -3886.0139047 hartree
pointgroup: C01 [X(C1B11I12)]
dipole: 0.0002226 0.0002747 -1.3885851 debye
dipolederiv: 0.055635 0.360741 -0.2105099 0.3605187 0.2488145 -0.2741418 -0.2163433 -0.2818581 0.0096017 -0.1043876 0.0000046 0.0000327 -0.0000093 -0.1044126 -0.0000997 0.0000305 -0.0000779 0.7325228 0.4656458 0.2031715 0.3314443 0.2031646 -0.1607389 0.0980746 0.3406048 0.1007954 0.009684 0.5553456 0.1905796 0.2834606 0.1905669 -0.0321311 0.0838957 0.3519288 0.1041648 0.1209468 0.1359893 -0.3270288 0.1673551 -0.3269216 0.3870358 -0.2436678 0.207894 -0.3025897 0.1209799 -0.2205878 0.0196729 0.0090738 0.019728 0.5250056 0.345763 0.0093352 0.3551232 0.0098227 0.0183632 -0.3485292 0.1957482 -0.3485855 0.2862115 -0.2850374 0.2010785 -0.2927305 0.0096998 -0.0881979 0.0186345 0.0077824 0.0185437 0.6111982 0.295641 0.0097414 0.3671179 0.1211433 0.533576 -0.220516 -0.278853 -0.2204 -0.0104454 0.0988327 -0.3461779 0.1226552 0.1212328 0.1710392 0.3383466 -0.180036 0.3382278 0.3521961 -0.2346291 -0.2235639 -0.2913291 0.1211592 0.4421812 -0.2351497 -0.3258539 -0.2349282 -0.1377927 0.1153385 -0.3349384 0.1186498 0.0096409 -0.2159069 -0.2111886 0.1266324 -0.2113278 -0.3289779 0.1650597 0.1251951 0.1631189 -0.1587649 -0.4559533 -0.1190298 -0.1993116 -0.1190308 -0.0889645 -0.0589776 -0.1971784 -0.0583534 -0.1590079 -0.4341552 -0.1182065 -0.2059164 -0.1181925 -0.0698176 -0.060947 -0.2143728 -0.0634477 -0.1613111 -0.1741145 0.2028433 -0.1217679 0.2026812 -0.3300631 0.1770271 -0.1265679 0.1842076 -0.1612685 -0.0539639 -0.0114858 -0.0054769 -0.0114068 -0.4907966 -0.2079119 -0.0053805 -0.2055184 -0.1589027 -0.1938995 0.2041986 -0.1177103 0.2041386 -0.3510041 0.17137 -0.1163468 0.1694373 -0.1588519 -0.0351374 -0.0115047 -0.0057948 -0.0113395 -0.4689285 -0.2148548 -0.0059156 -0.2234978 -0.161361 -0.4206419 0.1365478 0.202593 0.1367379 -0.0833067 -0.0718454 0.2107505 -0.0746674 -0.1614735 -0.1959239 -0.2096382 0.130808 -0.2098311 -0.3081395 0.1705424 0.1361028 0.1773306 -0.1614497 -0.4423078 0.1375783 0.1961427 0.1377273 -0.1024999 -0.069519 0.1938561 -0.0686769 -0.1588056 -0.3956177 -0.0000307 0.000111 -0.0000291 -0.3954401 -0.0000655 0.0003861 0.000058 0.0219502 -0.0564557 -0.000012 0.0000869 -0.0000203 -0.0564463 0.000104 -0.0000598 0.0000484 -0.615277 0.1094757 0.0000013 -0.0000404 -0.0000123 0.1094437 0.0000483 -0.0000585 0.0000399 -0.1919103 unknown
polarizability: 516.2371755|0.0069113|516.22194|-0.0000375|-0.0006713|512.3285951 unknown
InChI: InChI=1/CB11I12/c13-1-2(14)3(1,15)5(1,17)6(1,18)4(1,2,16)8(2,20)7(2,3,19)9(3,5,21)11(5,6,23)10(4,6,8,22)12(7,8,9,11)24
charge -1 multiplicity 1
24 atoms
B  -0.92530939 -1.20561699 0.81709231
B  0.00016369 -0.00015699 1.75230602
B  1.45743596 0.43135503 0.81720426
B  -1.46012561 -0.43214674 -0.69146664
B  -0.86220725 1.25506646 -0.69139284
B  0.04016499 1.51921651 0.81727285
B  0.86072114 -1.25271982 0.81690977
B  -0.04014241 -1.52207068 -0.69177642
B  1.43528694 -0.50847168 -0.69183427
B  0.92721197 1.20797945 -0.69155297
B  -1.43242912 0.50750552 0.81726604
I  -2.11152507 -2.75107616 1.75151151
I  3.32528676 0.98411362 1.7517608
I  -3.26983769 -0.96775513 -1.72722641
I  -1.93098412 2.81077572 -1.72686129
I  0.09153957 3.46645191 1.75191271
I  1.9638504 -2.8584796 1.75116764
I  -0.08993324 -3.40861665 -1.72775837
I  3.21400209 -1.13871787 -1.72784956
I  2.07624958 2.70511942 -1.72735793
I  -3.26869824 1.15804555 1.75187415
C  -0.00006383 0.00015312 -1.51845548
I  0.00021626 -0.00042015 3.91303766
I  -0.00033 0.00043876 -3.63437052
