program: Gaussian 16
title: Title
version: AS64L-G16RevC.01
frameworkgroup: C1[X(C4H6B12I11O2)]
method: UB3LYP
basis: def2TZVPP
operation: Freq
keyword: #N
keyword: Geom=AllCheck
keyword: Guess=TCheck
keyword: SCRF=Check
keyword: GenChk
keyword: UB3LYP/def2TZVPP
keyword: Freq
converged: YES YES NO YES
elementType: B
elementType: I
elementType: C
elementType: H
elementType: O
1716.lowfreq: -0.0007 -0.0005 0.0003 2.2249 2.8320 3.2357 15.8774 31.4414 51.7634
frequency: 15.8669 31.4364 51.7630 54.0349 54.7731 56.9309 57.5583 60.2411 63.0185 65.0216 65.9474 69.2020 70.5890 71.1551 71.9579 72.4594 73.2046 74.6436 75.3693 82.3084 82.9596 87.6783 97.6566 118.4131 141.0707 141.4574 141.5868 141.7908 142.7171 144.9219 146.8634 149.3689 149.5073 155.4590 220.4640 235.2592 318.3061 340.9078 365.3604 370.3764 370.7608 377.6019 390.3199 487.3164 544.8889 555.5958 559.9854 560.7649 562.5447 575.5438 635.8758 647.1809 648.2632 650.9998 652.5130 654.1929 696.8690 706.6440 720.3846 721.1144 724.6950 756.4690 762.7298 773.8189 775.3025 792.9465 828.4559 830.3187 832.2380 859.6883 862.3999 897.3354 899.0321 900.4131 903.5180 910.6288 923.0255 935.3542 939.7120 1050.4538 1091.5980 1119.6276 1177.3889 1200.4382 1211.2453 1252.5413 1289.2591 1409.0004 1459.9308 1470.9168 1480.8099 1499.5321 1672.0245 2976.9136 3023.9861 3082.8814 3111.1760 3125.8688 3215.5356
redmass: 5.6501 5.2716 21.1062 114.7402 85.2268 71.1610 65.7664 37.8473 87.4045 56.1237 73.2142 23.8901 100.6975 94.2422 84.8543 98.2408 45.3979 116.6438 29.7461 57.7761 53.8159 44.1681 5.5701 2.1536 19.3503 106.1618 107.3712 80.8625 99.8381 2.7578 21.4626 80.7223 116.0502 2.8284 3.4602 3.2676 4.8600 5.0032 11.1686 11.3039 11.3158 6.5414 11.3618 5.1907 5.1418 10.9731 6.3689 10.7377 10.8966 7.8122 5.5924 6.7856 2.2746 8.2362 11.0029 7.0013 8.2133 7.9224 10.9831 10.9256 9.2763 9.0292 6.9846 10.9564 10.9093 3.4365 9.4888 10.6167 4.0092 8.8332 3.5446 10.5056 10.5524 11.0128 6.7647 10.9412 10.9369 9.9507 8.9368 6.4109 3.8219 2.7938 1.2851 1.5065 1.4674 1.2728 2.4876 1.6861 1.2141 1.2574 1.0530 1.0559 9.5849 1.0690 1.0328 1.1022 1.0875 1.1032 1.0874
irintensity: 0.3747 0.0431 0.4505 0.0050 0.0189 0.0417 0.0001 0.1974 0.0101 0.0476 0.0094 0.3855 0.0021 0.0217 0.0271 0.0073 0.0726 0.0013 0.2188 0.6776 0.5827 0.4072 0.3919 0.3574 0.2176 0.0032 0.0023 0.1132 0.0702 0.9776 0.0099 0.0054 0.0357 3.6324 3.9985 5.9222 4.8288 3.7232 0.0082 8.4448 8.1393 8.2681 11.1661 14.3645 3.7978 0.0203 2.4418 0.1012 0.0294 2.1276 3.1938 1.0000 1.2192 0.1472 0.0389 3.6948 1.8847 1.4562 0.0090 0.0218 2.7888 2.1247 3.0185 0.0998 0.0710 5.8140 1.7830 0.7772 16.4833 10.5230 46.0342 1.7685 2.3454 0.2977 22.3132 16.5654 116.6852 151.6944 135.1789 14.4079 16.8897 168.9235 1.0927 15.9665 39.2279 2.7217 230.2198 31.0256 9.7600 23.5657 4.1849 3.7195 302.6190 3.6123 92.5650 32.2781 1.2611 18.2957 7.6251
temp: 298.150 k
press: 1.00000 atm
elementType: 5 5 5 5 5 5 5 5 5 5 5 5 53 53 53 53 53 53 53 53 53 53 53 6 1 6 1 6 8 6 1 1 1 8 1
symmnumber: 1
zpe: 416768.0 jmol-1
zpe.correction: 0.158739 hartree
zpe.thermalcorrener: 0.194792 hartree
zpe.thermalcorrenthalpy: 0.195736 hartree
zpe.thermalcorrgfe: 0.079844 hartree
zpe.sumelectzpe: -3881.501746 hartree
zpe.sumelectthermal: -3881.465693 hartree
zpe.sumelectthermalent: -3881.464748 hartree
zpe.sumelectthermalfe: -3881.580641 hartree
dipole: -1.2889 1.4744 -0.3648
dipole: 1.9920
quadrupole: -493.2542 -473.0343 -467.8083
quadrupole: 13.5859 -5.1458 2.6911
quadrupole: -15.2219 4.9980 10.2239 13.5859 -5.1458 2.6911
hfenergy: -3881.6604847 hartree
pointgroup: C01 [X(C4H6B12I11O2)]
dipole: -0.5945978 -0.1139681 0.4976922 debye
polarizability: 551.0345763|-1.785685|555.456891|-10.3280184|22.3624218|574.1336159 unknown
InChI: InChI=1/C4H6B12I11O2/c1-29-4(28)2-3-5-6(17)7(5,18)9(5,20)10(5,21)8(5,6,19)12(6,23)11(6,7,22)13(7,9,24)15(9,10,26)14(8,10,12,25)16(11,12,13,15)27/h2H,3H2,1H3
charge -2 multiplicity 2
35 atoms
B  -1.45755209 -0.07390413 -1.04021094
B  0.0585554 0.12668949 -1.97289166
B  1.16122426 1.07868756 -0.94135708
B  0.00191424 -0.05763846 1.44082819
B  -1.1141209 -1.01447589 0.43141394
B  0.62647657 -1.39144583 0.43743202
B  1.34196462 -0.68335741 -1.03317771
B  -0.56864284 1.45319957 -0.93847555
B  -1.29441875 0.75530775 0.52700841
B  0.33619219 1.4721497 0.59100719
B  1.52348859 0.14584911 0.53294401
B  -0.27819975 -1.3960713 -1.0958393
I  -3.3725697 -0.21093498 -2.08252117
I  2.62230014 2.4440469 -1.82530729
I  -0.03031168 -0.17648767 3.61535548
I  -2.5849513 -2.36314721 1.30358692
I  1.39954945 -3.22556643 1.32241188
I  3.03967143 -1.6203178 -2.03204246
I  -1.33905039 3.28821589 -1.8424999
I  -2.99629667 1.68374784 1.52068426
I  0.73427263 3.32253239 1.66943625
I  3.45030115 0.28985113 1.53832886
I  -0.6746684 -3.24142024 -2.19110739
C  -0.0244031 0.23227812 -3.57911437
H  -0.81508542 -0.43438538 -3.91457806
C  1.20321168 0.0029388 -4.35959948
H  2.04318889 0.67035413 -4.24507806
C  1.39345987 -1.03271298 -5.33464339
O  0.31136461 -1.85741451 -5.45772175
C  0.50234425 -3.00829468 -6.26197316
H  1.34052935 -3.60116841 -5.89424697
H  -0.41992338 -3.579078 -6.18376867
H  0.69765208 -2.7380168 -7.30170475
O  2.40174737 -1.1966229 -6.0092352
H  -0.36325591 1.25872494 -3.76858809
