program: Gaussian 16
title: Title
version: AS64L-G16RevC.01
frameworkgroup: C1[X(C3H5I)]
method: RB3LYP
basis: def2TZVPP
operation: Freq
keyword: #N
keyword: Geom=AllCheck
keyword: Guess=TCheck
keyword: SCRF=Check
keyword: GenChk
keyword: RB3LYP/def2TZVPP
keyword: Freq
converged: YES YES YES YES
title: Mulliken charges:
elementType: C H H C H C H H I
charge: -0.208388 0.094033 0.110371 -0.094958 0.119378 -0.230575 0.159118 0.142941 -0.091920
chargesum: 0.00000
title: Mulliken charges with hydrogens summed into heavy atoms:
elementType: C C C I
charge: -0.003984 0.024420 0.071483 -0.091920
chargesum: -0.00000
1716.lowfreq: -7.4720 -0.0008 -0.0006 -0.0005 4.3088 13.0320 107.5171 228.6986 378.7724
frequency: 107.5159 228.6985 378.7723 489.1330 691.3930 839.7588 953.0244 961.2284 1022.2788 1073.2928 1175.8266 1218.4825 1331.6538 1448.9507 1486.9952 1696.0706 3106.8928 3139.2310 3151.8936 3177.1135 3227.7077
redmass: 3.2267 2.5985 2.4041 2.2591 1.6690 1.3413 1.9368 1.3332 1.1128 1.2832 1.1924 1.5759 1.2583 1.1490 1.1618 4.2991 1.0561 1.0587 1.0933 1.1094 1.1156
irintensity: 0.1386 4.7352 0.2557 11.8093 34.7001 3.0303 7.4419 44.1316 7.9602 3.9200 55.0960 3.9755 0.6807 4.5956 6.1499 2.9410 4.5578 5.7208 2.3622 1.6098 8.5512
temp: 298.150 k
press: 1.00000 atm
elementType: 6 1 1 6 1 6 1 1 53
symmnumber: 1
zpe: 184858.4 jmol-1
zpe.correction: 0.070409 hartree
zpe.thermalcorrener: 0.075431 hartree
zpe.thermalcorrenthalpy: 0.076375 hartree
zpe.thermalcorrgfe: 0.040431 hartree
zpe.sumelectzpe: -415.102318 hartree
zpe.sumelectthermal: -415.097295 hartree
zpe.sumelectthermalent: -415.096351 hartree
zpe.sumelectthermalfe: -415.132296 hartree
dipole: 1.7373 0.7029 -0.0294
dipole: 1.8743
quadrupole: -44.0413 -46.1438 -45.4704
quadrupole: 0.2640 -0.4140 -0.3546
quadrupole: 1.1771 -0.9253 -0.2519 0.2640 -0.4140 -0.3546
hfenergy: -415.1727266 hartree
pointgroup: C01 [X(C3H5I1)]
dipole: -0.2748695 -0.5755398 0.370076 debye
dipolederiv: -0.0420248 -0.1583773 -0.0106017 -0.07119 -0.0879573 0.1262972 -0.0323123 0.1658273 -0.1655512 0.009837 0.0779844 0.0588829 0.0148264 0.0157861 -0.0754362 0.0409774 -0.0686692 0.0680864 -0.0788512 -0.038502 0.0166021 0.0241298 0.0975302 -0.0484787 -0.0061632 -0.0802536 0.1335491 0.1087518 0.0709761 -0.0517789 -0.0739346 -0.1024949 0.2240041 -0.0488501 0.1175591 -0.1364053 0.0012005 0.0050586 0.0357643 0.0384986 0.0174389 -0.0966316 0.0288781 -0.078109 0.0724974 0.2614968 0.2958337 -0.1104564 0.3189119 0.5015439 -0.2841297 -0.1904477 -0.3081464 0.2202863 -0.0068654 -0.0691497 -0.0000966 -0.0582781 -0.0236659 0.0684934 -0.0021189 0.0685876 -0.0473839 0.0114079 -0.0476772 0.0257384 0.0148305 -0.1008086 0.0150644 0.0564635 0.0432088 0.0151913 -0.2649525 -0.1361466 0.0359459 -0.2077945 -0.3173724 0.0708171 0.1535732 0.1399955 -0.1602701 unknown
polarizability: 74.8496141|23.0390798|80.6079533|-5.1491814|-6.4100048|57.028463 unknown
InChI: InChI=1/C3H5I/c1-2-3-4/h2H,1,3H2
charge 0 multiplicity 1
9 atoms
C  0.9605795 -1.20691477 -0.27425571
H  1.4380351 -1.98086975 -0.86254151
H  -0.11575975 -1.25159447 -0.18449668
C  1.66631316 -0.24481564 0.31041686
H  1.16261019 0.52692457 0.88150316
C  3.13805593 -0.15117861 0.23901515
H  3.60604616 0.02767721 1.20098777
H  3.59713868 -0.99786345 -0.25876907
I  3.76371802 1.59959221 -0.93865997
