program: Gaussian 16
title: Title
version: AS64L-G16RevC.01
frameworkgroup: C1[X(C9H9B11I10)]
method: UM062X
basis: def2TZVPP
operation: Freq
keyword: #N
keyword: Geom=AllCheck
keyword: Guess=TCheck
keyword: SCRF=Check
keyword: GenChk
keyword: UM062X/def2TZVPP
keyword: Freq
converged: YES YES YES YES
elementType: B
elementType: I
elementType: C
elementType: H
1716.lowfreq: -3.9936 -1.9685 -0.0004 -0.0002 0.0002 3.0810 18.1589 31.9162 38.9557
frequency: 18.1259 31.9123 38.9374 47.6616 49.3197 50.5949 51.8413 56.1122 58.3599 59.7321 61.8182 65.5315 65.9693 66.8451 67.8363 69.3464 72.4663 79.1052 79.9236 80.7605 81.3861 86.0274 88.6654 123.7567 146.4706 146.7327 147.0680 147.3122 148.2919 153.4533 153.7935 212.9301 254.5306 312.3881 316.2343 318.1249 359.7990 374.5329 376.0904 414.3527 425.7044 475.0428 557.3218 558.1234 565.2156 580.7326 592.4046 593.2091 597.6252 632.8386 667.6392 682.2073 682.6318 698.7091 700.3068 716.8851 737.8049 738.5421 753.8328 754.4459 786.9163 794.7743 805.0226 821.6566 821.9962 826.6726 828.8058 848.0535 848.7832 870.4927 894.5989 922.1124 922.3641 927.4991 928.5280 941.7457 948.8269 952.9095 955.4761 963.2927 965.6375 1006.1916 1016.6274 1024.7347 1037.7413 1046.4918 1066.1545 1118.5744 1126.7795 1128.4661 1174.2723 1205.4930 1238.5551 1314.5402 1334.6801 1358.7967 1450.3791 1492.4882 1542.0115 1648.8923 1675.9392 1718.6257 3160.9311 3172.9397 3189.7182 3198.1748 3204.7748 3212.0170 3221.3130 3222.4611 3260.9128
redmass: 6.2389 7.6922 6.8971 15.4063 73.8630 16.0182 60.3828 8.9521 48.5362 40.3365 23.6349 20.2894 69.9509 72.2783 18.7159 81.4692 9.1712 116.2064 101.6956 43.4680 50.7046 10.9624 11.9517 2.7023 102.2616 100.3016 106.0871 105.1613 107.4771 114.2377 112.7368 2.6770 2.5427 12.4882 8.4348 8.3985 11.1832 11.6658 11.7323 2.8771 2.9362 3.2091 11.0331 11.0331 3.1527 9.6369 8.6811 8.6741 11.0033 6.2284 1.8532 11.1269 11.1036 10.7867 10.9216 1.4870 11.0100 11.0028 8.8265 8.8661 9.6660 3.2732 2.1133 11.0052 10.9893 10.6097 10.5947 10.8992 11.0819 1.2595 8.6928 4.9498 4.8812 10.9676 10.9736 10.1335 1.4358 8.0318 7.6933 8.1884 1.4161 1.3776 1.6437 2.9947 1.2238 1.5540 1.8637 1.4891 1.3371 1.3309 1.1378 1.1207 2.3459 2.5424 1.9230 1.3271 1.2590 2.2326 2.3828 5.6755 5.9257 4.9593 1.0856 1.0647 1.0848 1.0874 1.0910 1.0949 1.0984 1.0900 1.1154
irintensity: 0.0270 0.0315 0.0401 0.0111 0.0009 0.0159 0.0010 0.0114 0.0131 0.0138 0.0314 0.0203 0.0027 0.0004 0.0007 0.0004 0.0052 0.0013 0.0049 0.1712 0.1772 0.1079 0.0335 0.0083 0.0304 0.0204 0.0007 0.0014 0.0154 0.0002 0.0039 1.3222 1.6026 3.5950 0.2610 0.3252 0.0115 12.9972 12.6575 0.5886 4.6651 11.7317 0.0056 0.0022 4.8948 2.5797 1.0555 1.1215 0.0093 0.0763 1.8084 0.0226 0.0338 0.1356 0.0858 60.5087 0.0113 0.0336 3.7252 3.6261 52.1705 10.3041 32.3690 0.0058 0.0062 0.1044 0.0662 0.0098 0.1214 3.6790 45.7840 54.2700 63.2316 0.4711 0.4135 116.6046 15.8715 160.7850 149.2852 52.4446 49.0620 0.2774 0.1494 0.1418 20.3980 8.9383 2.0540 3.3861 59.5646 58.5616 0.1334 0.3451 0.7209 1.8774 0.2784 0.6109 5.6311 3.1279 9.2949 2.1587 2.5367 3.7865 3.8786 2.3937 1.1095 1.5998 9.3690 18.4461 13.2635 16.9235 3.2711
temp: 298.150 k
press: 1.00000 atm
elementType: 5 5 5 5 5 5 5 5 5 5 53 53 53 53 53 53 53 53 53 6 1 6 1 1 5 53 6 6 6 6 1 6 1 6 1 1 1 6 1
symmnumber: 1
zpe: 552622.1 jmol-1
zpe.correction: 0.210483 hartree
zpe.thermalcorrener: 0.245252 hartree
zpe.thermalcorrenthalpy: 0.246197 hartree
zpe.thermalcorrgfe: 0.132669 hartree
zpe.sumelectzpe: -3598.471305 hartree
zpe.sumelectthermal: -3598.436535 hartree
zpe.sumelectthermalent: -3598.435591 hartree
zpe.sumelectthermalfe: -3598.549118 hartree
dipole: -0.3348 0.0901 1.2481
dipole: 1.2954
quadrupole: -418.3805 -417.7998 -418.9008
quadrupole: 0.0494 -0.0897 -0.6100
quadrupole: -0.0202 0.5606 -0.5404 0.0494 -0.0897 -0.6100
hfenergy: -3598.6817875 hartree
pointgroup: C01 [X(C9H9B11I10)]
dipole: -0.3242704 -0.0874607 -0.3833382 debye
polarizability: 541.7946798|-6.9244375|537.1805221|-38.0669554|-1.7525731|528.3780446 unknown
InChI: InChI=1/C8H8.CHB11I10/c1-2-8-6-4-3-5-7-8;13-3-1-4(3,14)6(1,16)7(1,17)5(1,3,15)9(3,19)2-8(3,4,9,18)10(2,4,6,20)12(2,6,7,22)11(2,5,7,9)21/h2-7H,1H2;1H
charge -1 multiplicity 2
39 atoms
B  0.9652167 1.44274281 -0.36921964
B  1.49226488 0.20673745 0.73475247
B  0.1519901 -0.55678976 1.53828842
B  0.07545778 -1.14208952 -1.2865968
B  1.00924326 -1.37960737 0.20889216
B  0.12160011 1.18765905 1.17891559
B  -0.8135306 1.43154312 -0.31471419
B  -1.31847637 0.19004822 0.86879974
B  -0.76835255 -1.40060265 0.26858988
B  1.51352987 -0.14243302 -0.97156705
I  2.06775762 3.25562581 -0.77490317
I  0.2186937 -1.30029712 3.56415184
I  -0.12063837 -2.57287847 -2.8742501
I  2.15365446 -3.18338195 0.5307382
I  0.10038714 2.69087439 2.73183683
I  -2.08492742 3.1104552 -0.72891844
I  -3.20005036 0.36702461 1.88649975
I  -1.98521014 -3.14419731 0.56106374
I  3.31199646 -0.3478687 -2.13819323
C  3.41824632 0.89703718 3.67479202
H  2.68994592 1.40415605 4.29194015
C  3.82700498 1.4247343 2.52576618
H  3.44287655 2.39549575 2.22309901
H  3.77956154 -0.06242894 4.02352803
B  0.0482714 0.6079677 -1.64631752
I  -0.17945871 1.29384078 -3.6668152
C  4.77597354 0.79399105 1.59378403
C  4.95069429 -0.59077088 1.5507047
C  5.51483829 1.58554357 0.71491991
C  5.87097771 -1.16049405 0.68739039
H  4.33021965 -1.22479094 2.1718386
C  6.44270679 1.01689185 -0.14516431
H  5.352981 2.65639615 0.70992422
C  6.63046306 -0.35779644 -0.1550781
H  5.9724878 -2.23719199 0.6501664
H  7.0062589 1.64710945 -0.82069323
H  7.34028307 -0.80558907 -0.83815949
C  -1.22558935 -0.1512025 -0.80043145
H  -2.16083085 -0.27447089 -1.32805105
