program: Gaussian 16
title: Title
version: AS64L-G16RevC.02
frameworkgroup: C1[X(C9H9BF3I)]
method: UM062X
basis: def2TZVPP
operation: Freq
keyword: #N
keyword: Geom=AllCheck
keyword: Guess=TCheck
keyword: SCRF=Check
keyword: GenChk
keyword: UM062X/def2TZVPP
keyword: Freq
converged: YES YES NO NO
elementType: C
elementType: H
elementType: I
elementType: B
elementType: F
1716.lowfreq: -3.1799 -0.0003 0.0004 0.0005 0.7642 4.4717 6.0362 11.1363 15.2826
frequency: 5.8687 10.3530 15.1827 28.4093 32.8933 51.0625 58.2708 110.3845 112.1901 151.6476 234.2796 279.9317 289.0040 331.4713 382.5623 412.6299 435.9069 492.3496 507.6852 552.6458 601.3788 630.6570 686.9405 704.1809 709.4430 765.2417 832.7855 904.1025 909.0796 954.9926 956.8368 967.3244 983.8153 1007.0506 1031.8766 1062.7339 1072.9192 1077.7959 1083.5812 1113.6188 1165.1627 1166.2924 1182.6798 1221.5629 1275.8816 1291.5957 1328.3642 1430.2662 1443.7942 1484.7200 1485.7060 1564.7624 1649.0880 1722.7839 3120.2413 3163.7464 3166.3461 3174.1021 3187.8991 3191.0907 3196.1395 3199.5443 3253.7383
redmass: 12.3983 4.9217 6.7074 4.6075 5.7878 7.8532 3.7231 3.4728 7.2168 7.1791 2.5916 6.5740 9.7599 10.2192 2.3270 3.6970 7.4709 13.2540 2.1938 6.2058 9.8654 7.6135 2.2533 1.7363 8.5747 1.4797 1.3546 1.4499 1.2997 1.3502 1.7845 10.1975 1.3272 5.1367 1.1234 2.3446 2.4957 1.3133 11.4444 3.1789 1.4997 1.2166 1.8421 1.5928 2.8415 1.7574 1.2561 2.6841 1.1433 2.4354 1.1599 6.0495 7.0808 4.7238 1.0565 1.0594 1.0848 1.0950 1.0910 1.1065 1.0883 1.0943 1.1159
irintensity: 0.1858 0.3887 2.5786 3.4776 6.7597 1.7820 0.3541 0.0962 0.0081 0.2727 0.4238 0.2946 7.9758 0.8004 12.9288 0.6084 2.6086 0.2194 7.7390 0.1118 11.7823 7.8902 20.2619 12.1138 2.8961 41.0331 5.6869 11.8650 8.0266 50.1426 3.6301 227.3679 0.0766 169.5681 4.8332 54.3998 123.7430 4.3770 271.0737 108.2957 101.5536 37.1183 221.9916 11.4702 9.2066 5.3172 0.6452 5.5401 2.0691 0.5767 3.8314 26.4513 1.2619 27.9479 11.4312 5.2999 13.0654 3.7444 21.5395 4.3781 3.6945 22.2803 12.0478
temp: 298.150 k
press: 1.00000 atm
elementType: 6 6 6 6 6 6 1 1 53 6 1 1 6 1 6 1 1 1 1 5 9 9 9
symmnumber: 1
zpe: 422381.0 jmol-1
zpe.correction: 0.160876 hartree
zpe.thermalcorrener: 0.176660 hartree
zpe.thermalcorrenthalpy: 0.177604 hartree
zpe.thermalcorrgfe: 0.107734 hartree
zpe.sumelectzpe: -970.394575 hartree
zpe.sumelectthermal: -970.378791 hartree
zpe.sumelectthermalent: -970.377847 hartree
zpe.sumelectthermalfe: -970.447717 hartree
dipole: -17.7546 -2.4825 0.3328
dipole: 17.9304
quadrupole: -192.0421 -109.9813 -110.8147
quadrupole: -16.6628 1.1196 0.3371
quadrupole: -54.4294 27.6314 26.7980 -16.6628 1.1196 0.3371
hfenergy: -970.5554514 hartree
pointgroup: C01 [X(C9H9B1F3I1)]
dipole: 6.6693359 -2.0901592 -0.9566982 debye
dipolederiv: -0.6118156 0.156809 0.0638607 -0.1007265 -0.0448404 0.0282253 -0.2515542 0.0930675 -0.0346766 -0.2504529 0.0554997 0.0520794 0.2830057 -0.2437233 -0.0225949 0.3467019 -0.0840391 -0.1905198 0.0302236 0.0092225 0.0488135 0.0612379 -0.1503775 -0.0034866 0.1193203 -0.0153505 -0.129643 0.2313969 -0.0197047 0.0707896 -0.0889956 -0.0637136 0.1074858 -0.0255258 0.1263488 -0.0097446 -0.4873879 -0.0143049 -0.1134598 0.0292931 -0.1321391 0.0271938 -0.0391833 0.0139229 -0.1364875 0.113805 -0.0580902 -0.0173458 -0.0217222 -0.0224284 0.08738 0.0378628 0.0752886 0.014073 0.1411373 -0.0507276 -0.0584576 -0.0562814 0.0897786 -0.054056 -0.0686237 -0.0516409 0.0373482 0.0351661 0.074022 0.0734517 0.0703988 0.069664 -0.0766846 0.0663579 -0.0754312 0.0600934 0.7917642 0.0114457 0.2001927 0.0755929 -0.1985583 -0.018378 0.1861865 0.0074476 -0.1045406 0.143086 -0.0297931 0.0359815 0.0748171 0.0190334 0.023768 0.0091937 -0.0032324 0.0629897 -0.0983817 0.0128217 -0.0493981 0.0515208 0.0138493 -0.0408982 -0.0720634 -0.0389528 -0.0254852 -0.1762481 -0.0351371 0.0143951 0.0121287 -0.0033126 0.017138 -0.0015114 0.0594906 0.0138855 -0.0673714 -0.1054625 -0.2120912 -0.5653179 0.2024156 -0.0665274 -0.2242383 -0.0186246 -0.0408721 0.0789969 -0.012388 0.0811746 0.0399102 -0.0162654 0.0626873 0.0497831 0.0626916 0.0232094 -0.3985111 0.055053 -0.0943945 0.2326978 -0.0139308 -0.0799771 -0.0038203 -0.1473013 -0.1242871 0.0699227 0.0119145 0.0545561 -0.0417467 -0.024344 0.0943238 0.0530019 0.0572397 0.0252282 0.1191057 0.0364018 0.051172 0.1186881 -0.0762202 0.0052301 0.1142952 0.0091793 0.0901634 -0.1031022 -0.0117833 -0.069399 -0.0138157 0.1048257 -0.0271997 -0.0709221 -0.0263258 0.0723773 -0.0204935 -0.0273982 -0.0712234 -0.027607 0.0213026 -0.1369876 -0.0691071 -0.1361779 -0.0723397 2.0082566 -0.2922488 -0.246722 -0.4860064 1.6963843 0.1259478 -0.5069974 0.1792738 1.6068301 -0.8516669 0.3646442 -0.0625935 0.4747505 -0.8780584 0.1512589 -0.1021627 0.2020701 -0.6348587 -1.0839222 -0.112813 0.3200514 -0.1939945 -0.6537572 0.1127726 0.4016399 0.0522162 -0.6189502 -0.6135075 -0.0179829 -0.0714337 0.0721724 -0.6955841 -0.3166216 0.0513664 -0.3411599 -0.8837935 unknown
polarizability: 257.8280877|-29.6850098|127.5123283|5.4892527|21.4776294|132.4715326 unknown
InChI: InChI=1/C6H4BF3.C3H5I/c8-7(9,10)6-4-2-1-3-5-6;1-2-3-4/h1-2,4-5H;2H,1,3H2
charge -1 multiplicity 2
23 atoms
C  -1.50692751 1.8051303 0.5397175
C  -2.86569319 1.77923296 0.18758695
C  -3.22975094 0.99594811 -0.91262325
C  -2.3085791 0.26207055 -1.64795463
C  -0.9546088 0.28716404 -1.29854433
C  -0.6374539 1.06439454 -0.21700722
H  -1.18885869 2.4003364 1.38687167
H  -0.21199948 -0.27401833 -1.85141838
I  2.29553792 1.05908221 0.43216326
C  4.42298054 1.04601113 0.90168971
H  4.4724314 1.45015076 1.90819195
H  4.89491396 1.72581693 0.1993394
C  4.97023758 -0.32668724 0.81251108
H  4.5892812 -1.03986797 1.53620367
C  5.85852508 -0.71727528 -0.09221369
H  6.24036066 -0.02912368 -0.83694063
H  6.22213217 -1.73511058 -0.12416324
H  -4.27622265 0.96661935 -1.19480513
H  -2.62977887 -0.3339433 -2.49535857
B  -3.98618647 2.63383573 1.0287503
F  -4.60859856 3.56609844 0.17681204
F  -4.9680158 1.75987452 1.53320043
F  -3.36923646 3.3127392 2.09538131
