program: Gaussian 16
title: Title
version: AS64L-G16RevC.02
frameworkgroup: C1[X(C3H5B12I12)]
method: UM062X
basis: def2TZVPP
operation: Freq
keyword: #N
keyword: Geom=AllCheck
keyword: Guess=TCheck
keyword: SCRF=Check
keyword: GenChk
keyword: UM062X/def2TZVPP
keyword: Freq
converged: YES YES YES YES
elementType: B
elementType: I
elementType: C
elementType: H
1716.lowfreq: -122.8857 -2.4174 -0.0007 -0.0005 -0.0000 2.1779 3.3425 13.0303 15.9446
frequency: -122.8856 12.9918 15.8833 42.1104 52.1514 53.2144 54.7086 56.3380 57.6911 59.3530 61.2548 61.9098 64.4634 65.9280 69.3207 69.5453 70.3132 70.9772 71.5688 74.3917 75.7411 82.0467 82.4472 83.2719 88.1081 122.9496 143.6781 143.7737 144.2483 144.3653 144.5202 149.1307 150.7242 150.9614 270.7380 326.4413 340.8063 344.0648 363.5686 376.5899 378.0094 399.8476 490.1202 591.4694 593.3122 594.7270 595.2654 600.3785 601.0427 681.8743 682.6104 683.4515 683.7527 728.0856 755.8195 756.1912 763.2744 763.7036 778.9085 820.4327 821.5416 838.1217 839.6019 841.9053 845.2510 846.7652 884.9486 926.5312 927.6984 929.4058 941.5535 942.1773 946.2615 958.1243 958.5661 959.9630 977.1258 1008.9879 1076.0164 1170.4633 1217.8001 1312.9806 1432.2751 1482.6889 1652.2477 3142.4047 3146.2019 3189.1832 3221.4576 3242.0377
redmass: 6.4917 35.7019 36.8798 6.3287 50.9365 89.9400 85.8390 29.0764 64.6049 19.4172 43.8774 19.4618 59.7932 85.8563 120.1238 36.6561 56.4376 104.6821 19.3776 107.2152 25.6735 18.9620 46.7411 11.5450 7.8838 6.0499 107.3446 107.0661 102.8963 98.2400 110.2410 111.0360 116.0928 115.9136 2.7040 11.5650 11.0519 10.6992 11.1769 12.0531 12.3954 2.2054 2.4727 9.5249 11.0137 11.0201 11.0110 10.9700 10.9808 11.1152 10.8808 11.0941 11.0610 1.5733 10.9568 11.0115 10.9103 10.2026 8.7817 11.0035 11.0062 9.6145 5.9722 1.5552 10.1241 9.6047 7.1192 10.9933 10.8519 9.9491 10.0701 10.2684 7.9567 2.6975 6.2128 4.0076 1.3908 1.1835 1.2942 1.1827 1.5661 1.3030 1.1706 1.1711 3.7656 1.0569 1.0600 1.0911 1.1104 1.1161
irintensity: 19.4531 0.0103 0.0697 0.7370 0.0222 0.0036 0.0236 0.1131 0.0675 0.1420 0.0618 0.1965 0.0200 0.0223 0.0015 0.0736 0.0675 0.0289 0.1097 0.0013 0.1977 0.5175 0.6338 0.5923 0.0259 9.6961 0.0318 0.0537 0.0037 0.0323 0.0061 0.0129 0.0036 0.0010 27.9400 3.3686 2.3864 0.6881 0.0107 18.6721 18.7458 12.1221 102.2576 28.3860 0.1811 0.0533 0.2141 0.5249 0.4792 0.3856 0.8000 0.1882 0.1823 117.6984 0.1587 0.0075 0.3863 1.9310 12.6346 0.0061 0.0113 0.0440 0.2073 1.7544 1.1919 1.2711 4.1970 0.1073 0.2611 1.8597 22.6649 30.8901 119.3036 133.9657 198.5108 130.0166 13.6503 43.2106 3.0947 245.7211 0.9328 3.3869 21.9819 18.4904 60.0482 2.1022 0.3351 2.2560 0.5452 0.4430
temp: 298.150 k
press: 1.00000 atm
elementType: 5 5 5 5 5 5 5 5 5 53 53 53 53 53 53 53 53 53 6 1 6 1 1 5 53 6 53 1 1 5 53 5
symmnumber: 1
zpe: 355499.4 jmol-1
zpe.correction: 0.135403 hartree
zpe.thermalcorrener: 0.169813 hartree
zpe.thermalcorrenthalpy: 0.170757 hartree
zpe.thermalcorrgfe: 0.055495 hartree
zpe.sumelectzpe: -3987.746722 hartree
zpe.sumelectthermal: -3987.712311 hartree
zpe.sumelectthermalent: -3987.711367 hartree
zpe.sumelectthermalfe: -3987.826629 hartree
dipole: -0.3291 0.0199 -0.2653
dipole: 0.4231
quadrupole: -525.9280 -478.2163 -477.8590
quadrupole: -0.0399 1.4716 -0.0078
quadrupole: -31.9269 15.7848 16.1421 -0.0399 1.4716 -0.0078
hfenergy: -3987.8821241 hartree
pointgroup: C01 [X(C3H5B12I12)]
dipole: 0.1413964 0.0104903 0.0872416 debye
polarizability: 682.8991309|-0.9745855|546.1622145|-12.3933867|0.3814811|545.5201492 unknown
InChI: InChI=1/C3H5I.B12I11/c1-2-3-4;13-2-1-3(2,14)5(1,16)6(1,17)4(1,2,15)8(2,19)7(2,3,18)9(3,5,20)11(5,6,22)10(4,6,8,21)12(7,8,9,11)23/h2H,1,3H2;
charge -2 multiplicity 2
32 atoms
B  -0.20891451 -1.48017247 -0.49414755
B  -0.35861889 1.36957027 -0.7909049
B  -0.63024898 0.18334872 1.82153619
B  0.49572816 1.01768632 0.72216242
B  -0.7958647 -0.17583125 -1.5431638
B  -1.93181364 -1.02397277 -0.46552738
B  -2.02479056 0.75439503 -0.65005292
B  -1.21918897 1.50013511 0.76310683
B  0.58689826 -0.74195545 0.90637336
I  0.5049713 -3.3648396 -1.32597546
I  0.15231622 3.11167395 -1.99773639
I  -0.51744347 0.4156258 3.97116094
I  2.09816545 2.30930749 1.44327596
I  -0.85600325 -0.4022127 -3.71097792
I  -3.47622974 -2.33443986 -1.23051459
I  -3.68804104 1.71335887 -1.65108085
I  -1.85415389 3.40914532 1.5635751
I  2.28084839 -1.70076062 1.89397069
C  2.82745611 -0.14889432 -2.11776981
H  2.19088229 -0.79793276 -2.70603361
C  3.79251995 -0.64669768 -1.33509905
H  3.89444387 -1.71866087 -1.21288911
H  2.71223181 0.9202468 -2.26427329
B  -1.07050637 -1.37645489 1.0618596
I  -1.51953184 -3.13459191 2.24328102
C  4.67435817 0.20923775 -0.53080202
I  6.77144888 0.07960539 -1.23078945
H  4.4398304 1.26461563 -0.60509071
H  4.76359658 -0.09864271 0.50542423
B  0.68653877 -0.0064149 -0.66061978
I  -4.07019067 0.02587154 2.03004756
B  -2.1856655 0.01321815 0.9645232
