program: Gaussian 16
title: Title
version: AS64L-G16RevC.01
frameworkgroup: C1[X(C9H9B11I10)]
method: UM062X
basis: def2TZVPP
operation: Freq
keyword: #N
keyword: Geom=AllCheck
keyword: Guess=TCheck
keyword: SCRF=Check
keyword: GenChk
keyword: UM062X/def2TZVPP
keyword: Freq
converged: YES YES YES YES
elementType: B
elementType: I
elementType: C
elementType: H
1716.lowfreq: -1.9766 0.0002 0.0004 0.0005 1.3617 3.4892 9.7854 25.4125 49.0143
frequency: 9.7104 25.4122 49.0142 49.7362 52.2663 54.5900 59.4437 61.3397 62.8992 66.0948 67.3823 67.9781 68.9038 69.5231 72.1787 77.8603 80.0083 80.5955 82.7571 87.5008 95.4803 135.2651 146.6430 146.8864 147.4700 147.9792 149.8362 154.7397 155.0608 160.6305 256.7290 270.0796 321.2937 342.8617 346.5449 362.7568 380.3888 392.2084 418.0125 470.1054 490.9550 507.3813 556.2528 565.9891 568.9726 591.6861 602.6249 610.8817 628.4598 680.3504 681.2813 688.9961 692.3338 696.4522 711.5622 732.8187 736.7196 747.2050 750.4301 762.8915 782.0413 787.4944 803.9348 816.9913 829.0952 829.8945 851.2983 852.2620 853.8921 887.6437 889.8459 914.8731 917.2411 922.8830 935.7481 938.8002 943.7386 955.2835 961.5945 970.5921 996.3765 999.0134 1005.2592 1048.0451 1057.9874 1101.9589 1123.9319 1131.6744 1132.8316 1167.1401 1188.9631 1218.0855 1247.0582 1268.2542 1327.2938 1354.4469 1437.6415 1462.2859 1501.9950 1521.9483 1612.5106 1631.9988 3032.4920 3113.2633 3185.3753 3195.7848 3198.6813 3203.7231 3215.2170 3218.5176 3223.0317
redmass: 7.1004 6.9457 20.2427 114.7677 16.7552 12.8847 100.6454 45.8032 68.1650 79.0751 117.2573 117.3429 83.4897 54.3752 11.3054 15.4053 121.6191 90.8005 62.2806 18.1147 17.8770 5.1285 89.6239 105.7468 75.3651 98.5670 96.9075 86.3402 112.1225 5.5926 4.6983 2.6853 5.7187 7.6349 6.2997 11.1606 7.9672 6.7100 2.9832 4.1761 2.5934 5.4832 3.6975 10.3775 10.6885 7.2294 11.0077 6.7382 6.3698 10.9476 10.9529 8.3688 9.4855 1.8616 2.9659 2.0145 4.6895 10.8912 10.8781 5.2436 3.4449 3.1204 7.4499 5.2628 10.9863 10.6505 2.4814 6.2352 2.4578 3.5014 7.3818 2.0616 2.8011 4.3187 10.0022 10.6486 9.2346 6.1625 5.3421 10.4268 1.3626 4.0006 1.3899 4.0636 2.8498 2.2202 1.7617 1.3695 1.3499 1.1472 1.1915 1.2865 1.4279 1.5676 3.9196 1.4694 1.4330 1.4820 2.1696 2.1923 4.8209 5.2731 1.0670 1.0907 1.0852 1.0869 1.0866 1.0926 1.0922 1.0903 1.0973
irintensity: 0.0021 0.0303 0.0024 0.0001 0.0008 0.0018 0.0009 0.0022 0.0053 0.0008 0.0001 0.0003 0.0034 0.0012 0.0042 0.0632 0.0006 0.0136 0.1010 0.0596 0.0079 0.1893 0.0057 0.0006 0.0170 0.0109 0.0059 0.0106 0.0015 0.2203 0.8811 0.1864 1.4191 2.0408 3.0238 0.0203 9.8131 8.7876 0.7635 2.3096 13.4430 1.4373 2.6668 0.0289 0.0592 0.7992 0.0212 0.9092 0.3359 0.1078 0.0926 0.8584 2.4841 40.0477 2.1405 3.0666 1.4016 0.0365 0.2559 20.2668 22.1832 17.2531 3.8985 3.1895 0.0826 0.3649 1.0212 0.5541 0.4542 20.5855 57.8105 7.9829 10.4903 52.6996 4.5122 4.1324 72.5856 146.1476 92.3471 49.7616 0.0971 5.9927 0.2845 1.3608 18.7679 11.5896 7.2978 54.9304 52.8811 0.1959 1.6356 0.1093 3.5325 2.7145 2.2552 0.0501 8.2719 2.4934 11.1540 15.2755 3.4810 14.6679 2.2877 0.8145 6.8162 1.5912 0.7119 24.2052 16.1506 17.2475 22.5612
temp: 298.150 k
press: 1.00000 atm
elementType: 5 5 5 5 5 5 5 5 5 5 5 53 53 53 53 53 53 53 53 53 53 6 1 6 1 1 6 1 6 6 6 6 1 6 1 6 1 1 1
symmnumber: 1
zpe: 556373.3 jmol-1
zpe.correction: 0.211911 hartree
zpe.thermalcorrener: 0.245444 hartree
zpe.thermalcorrenthalpy: 0.246388 hartree
zpe.thermalcorrgfe: 0.136312 hartree
zpe.sumelectzpe: -3598.523917 hartree
zpe.sumelectthermal: -3598.490385 hartree
zpe.sumelectthermalent: -3598.489441 hartree
zpe.sumelectthermalfe: -3598.599517 hartree
dipole: 1.2805 -0.0613 1.2966
dipole: 1.8233
quadrupole: -425.6312 -416.3729 -417.5535
quadrupole: 0.2865 0.6705 1.2831
quadrupole: -5.7787 3.4797 2.2990 0.2865 0.6705 1.2831
hfenergy: -3598.7358288 hartree
pointgroup: C01 [X(C9H9B11I10)]
dipole: 0.5002531 -0.02945 0.5133041 debye
polarizability: 617.6074879|-2.7010772|533.9924863|8.7694625|4.0566783|487.7166962 unknown
InChI: InChI=1/C9H9B11I10/c21-11-9-12(11,22)14(9,24)15(9,25)13(9,11,23)17(11,27)10(7-6-8-4-2-1-3-5-8)16(11,12,17,26)18(10,12,14,28)20(10,14,15,30)19(10,13,15,17)29/h1-6,9H,7H2
charge -1 multiplicity 2
39 atoms
B  0.90599191 0.78175949 -1.24598654
B  -0.71682269 0.02447463 -1.14195739
B  -0.56380805 -1.36851609 -0.01889985
B  1.35781827 1.39927588 0.35451527
B  0.02930776 1.01965682 1.48009607
B  -1.24372242 0.1689298 0.56637119
B  0.76180963 -0.98864009 -1.14072266
B  2.03643406 -0.13966741 -0.23650538
B  1.12895514 -1.46796888 0.52699332
B  -0.11144799 -0.75048875 1.58637577
B  -0.33148406 1.49603322 -0.18810843
I  1.57179888 1.76859202 -3.04229833
I  -1.73053083 -3.18124253 -0.13856648
I  2.64414473 3.07670188 0.72290817
I  -0.29599778 2.23690513 3.21670934
I  -3.30815664 0.36533287 1.13710177
I  1.23537581 -2.27677645 -2.80191634
I  4.14314231 -0.32714112 -0.59594119
I  2.14493667 -3.26686336 1.10724334
I  -0.59545622 -1.68064554 3.45876694
I  -1.2404692 3.4064556 -0.60833174
C  1.39661247 0.00808145 1.33773738
H  2.09554396 0.00091239 2.16241407
C  -1.64772261 0.13005191 -2.45097742
H  -0.97974798 -0.10410542 -3.28799887
H  -1.92009347 1.17993798 -2.56821737
C  -2.83537859 -0.74989826 -2.54550592
H  -2.6497051 -1.80085598 -2.72352294
C  -4.1880072 -0.34456104 -2.49543033
C  -5.21041417 -1.31199489 -2.6516821
C  -4.59407845 0.99505044 -2.28710374
C  -6.54329725 -0.96269366 -2.61512376
H  -4.92243172 -2.34649867 -2.79436271
C  -5.93160126 1.33423745 -2.25598108
H  -3.84879 1.76215021 -2.12429927
C  -6.91929082 0.36588743 -2.42150593
H  -7.30107371 -1.72668843 -2.73439161
H  -6.21249781 2.36635707 -2.0894122
H  -7.96517657 0.64015291 -2.39141508
