program: Gaussian 16
title: Title
version: AS64L-G16RevC.01
frameworkgroup: C1[X(C4H5B11I12)]
method: UM062X
basis: def2TZVPP
operation: Freq
keyword: #N
keyword: Geom=AllCheck
keyword: Guess=TCheck
keyword: SCRF=Check
keyword: GenChk
keyword: UM062X/def2TZVPP
keyword: Freq
converged: YES YES YES YES
elementType: B
elementType: I
elementType: C
elementType: H
1716.lowfreq: -214.9611 -0.0004 -0.0004 0.0001 1.6723 2.2015 3.7894 14.1471 23.7771
frequency: -214.9610 14.0337 23.7685 49.4722 53.3792 54.1564 56.2433 57.0079 58.7349 61.3463 63.4935 66.9533 68.3707 68.5929 69.3764 69.9549 70.7496 71.7726 78.9836 79.2762 83.8027 84.4734 88.1319 93.6416 106.4783 138.0309 147.1348 147.1996 147.5618 148.0100 149.3455 152.9956 154.8471 154.8823 305.0655 325.7087 345.5840 347.5730 361.1560 388.1612 389.3319 402.9696 531.9071 540.7628 542.3273 584.9265 595.7356 597.0008 597.1728 672.1118 673.7452 694.3455 696.3338 733.8878 735.3699 751.9461 761.5510 764.1903 782.4719 806.4379 811.9363 812.1990 814.6568 849.8298 850.0133 853.1308 883.2986 921.0628 923.3178 925.9520 926.6416 948.6361 952.5032 960.2132 967.3585 968.6292 995.3235 1029.0937 1081.7898 1182.8314 1221.7828 1316.4798 1434.5063 1482.1937 1631.3538 3137.5028 3160.6520 3190.4691 3216.0496 3263.2138
redmass: 6.6899 72.1048 51.0698 11.5975 116.5566 55.2029 66.0118 78.3516 76.9978 72.5027 85.0109 59.9559 49.0683 105.2561 111.8345 104.9106 89.0175 66.4160 60.8250 102.5615 59.8075 57.0817 33.6066 4.5558 4.8131 4.3215 103.8854 104.0120 103.0591 55.3113 106.6382 97.0098 110.0497 112.9289 2.7756 9.7950 11.3305 10.8327 11.1807 11.7695 12.4997 2.1633 2.7552 10.7137 11.0196 8.2705 11.0219 11.1240 11.1078 11.1364 11.1376 11.2060 10.8305 10.8947 10.9111 1.7649 9.8685 5.9196 8.3806 11.0612 11.0136 10.7218 10.5385 8.4465 10.9163 1.3965 10.8212 10.9491 11.0422 11.0038 10.8116 9.2105 5.4403 2.2080 10.2043 10.3658 1.2183 1.1866 1.2718 1.1917 1.5661 1.3134 1.1772 1.1580 3.5709 1.0568 1.0583 1.0908 1.1088 1.1160
irintensity: 203.4068 0.0476 0.0295 0.2114 0.0024 0.0238 0.0605 0.0461 0.0483 0.0471 0.0727 0.0503 0.2921 0.0048 0.0065 0.0214 0.0955 0.0531 0.0481 0.0097 0.1955 0.2533 0.1410 2.0359 1.4708 1.1022 0.0026 0.0019 0.0190 0.0196 0.0008 0.0071 0.0015 0.0003 3.9753 66.9910 0.8404 0.6296 0.0015 9.4363 9.4483 1.3682 27.2062 0.4907 0.0714 86.3842 0.0599 0.3023 0.1244 0.0562 0.0492 0.5988 0.8826 0.3133 0.0575 47.5011 1.2459 5.9675 41.9416 0.1982 0.0100 0.3137 0.7715 0.4862 0.1527 4.6992 5.9262 0.7458 2.1819 0.3948 0.5593 92.1712 26.2093 42.0952 231.0471 223.1246 247.3905 5.8459 1.6786 79.7664 17.6019 35.2399 16.2791 7.3412 340.8370 0.1151 34.6759 1.6233 0.4191 1.3362
temp: 298.150 k
press: 1.00000 atm
elementType: 5 5 5 5 5 5 5 5 5 53 53 53 53 53 53 53 53 53 6 1 6 1 1 5 53 5 53 6 6 53 1 1
symmnumber: 1
zpe: 356323.3 jmol-1
zpe.correction: 0.135716 hartree
zpe.thermalcorrener: 0.169829 hartree
zpe.thermalcorrenthalpy: 0.170773 hartree
zpe.thermalcorrgfe: 0.057481 hartree
zpe.sumelectzpe: -4000.894959 hartree
zpe.sumelectthermal: -4000.860846 hartree
zpe.sumelectthermalent: -4000.859902 hartree
zpe.sumelectthermalfe: -4000.973195 hartree
dipole: -2.9060 0.1535 0.6502
dipole: 2.9818
quadrupole: -463.1555 -440.8693 -441.0214
quadrupole: -0.3314 1.1300 -0.0347
quadrupole: -14.8067 7.4794 7.3273 -0.3314 1.1300 -0.0347
hfenergy: -4001.0306752 hartree
pointgroup: C01 [X(C4H5B11I12)]
dipole: 1.1402685 -0.0498641 0.2711718 debye
polarizability: 681.6698581|5.7755563|524.0376673|5.0477977|0.2478955|524.2502537 unknown
InChI: InChI=1/C3H5I.CB11I11/c1-2-3-4;13-2-1-3(2,14)5(1,16)6(1,17)4(1,2,15)8(2,19)7(2,3,18)9(3,5,20)11(5,6,22)10(4,6,8,21)12(7,8,9,11)23/h2H,1,3H2;
charge -1 multiplicity 2
32 atoms
B  0.15797736 1.46570773 0.62666174
B  0.00797584 -1.39436084 0.90247382
B  -0.60043482 -0.16031631 -1.63741029
B  0.65597265 -1.02744013 -0.71343861
B  -0.3055396 0.14859317 1.73224354
B  -1.56226605 1.02911294 0.82566384
B  -1.65512007 -0.75371305 0.99598797
B  -1.05744493 -1.48791061 -0.52521339
B  0.74389926 0.73977506 -0.88832171
I  1.07321414 3.25565004 1.39030524
I  0.7116358 -3.10330153 2.00240864
I  -0.74374163 -0.36336061 -3.77060117
I  2.16144437 -2.2867887 -1.59198529
I  -0.01408516 0.3299428 3.856006
I  -2.92822428 2.34798339 1.82882443
I  -3.14129882 -1.71055405 2.21594521
I  -1.77956203 -3.37875152 -1.24217733
I  2.31734898 1.66676595 -2.02717303
C  3.15127015 0.00296987 1.78395396
H  2.60715505 0.66187602 2.44618153
C  4.01406526 0.49896789 0.88572657
H  4.09483791 1.5718572 0.75250207
H  3.07452192 -1.06347844 1.96326993
B  -0.91139509 1.39541523 -0.80160244
I  -1.45168328 3.18004856 -1.86706281
B  -2.01970415 0.01575465 -0.57117139
I  -4.0181285 0.04108529 -1.36589393
C  4.87392104 -0.34844011 0.03605056
C  0.92585054 -0.02255356 0.59895132
I  6.95964944 -0.00130205 0.54105089
H  4.71026271 -1.40854319 0.18889594
H  4.81715098 -0.09634307 -1.01787481
