program: Gaussian 16
title: Title
version: AS64L-G16RevC.01
frameworkgroup: C1[X(C12H12IN)]
method: UM062X
basis: def2TZVPP
operation: Freq
keyword: #N
keyword: Geom=AllCheck
keyword: Guess=TCheck
keyword: SCRF=Check
keyword: GenChk
keyword: UM062X/def2TZVPP
keyword: Freq
converged: YES YES NO YES
elementType: C
elementType: H
elementType: N
elementType: I
1716.lowfreq: -5.9114 -0.0001 0.0006 0.0009 2.7793 7.5480 18.5000 39.0391 50.8137
frequency: 18.4076 39.0319 50.8120 76.6607 103.1521 115.3776 127.7295 158.6024 184.2873 235.9496 265.6141 383.1427 403.2095 434.6048 465.4483 514.5373 534.9092 547.5270 582.9771 593.9403 624.8910 635.0378 758.9510 784.2808 792.0251 830.5217 843.9640 859.1743 862.1820 867.0415 926.1767 938.2078 959.9541 1005.9667 1016.4060 1023.6460 1043.8450 1046.9491 1090.9832 1097.0161 1150.5252 1165.8885 1194.9909 1226.3618 1256.5271 1284.9518 1297.7869 1332.5259 1390.3136 1403.9521 1410.9175 1441.1151 1495.7924 1497.5369 1513.9205 1528.5879 1609.7320 1649.8545 1660.9746 1694.8675 3158.4631 3170.6242 3173.8763 3212.2436 3214.6184 3224.5506 3234.1273 3245.8047 3260.4567 3260.5543 3276.8908 3577.4203
redmass: 4.6441 3.1311 5.1722 4.7954 3.2610 5.6617 1.5725 6.4427 3.7687 11.5281 4.8073 3.1590 4.1398 1.8909 2.5751 4.1150 6.8127 1.3010 1.0523 7.2757 3.0605 6.9088 1.7481 1.8876 4.8540 1.3172 1.3317 1.4672 5.6342 1.4635 1.4285 1.1628 5.0588 1.3531 1.3434 1.1800 1.3804 1.7986 2.4502 2.2427 2.2502 1.4673 1.1960 2.0654 1.5326 2.1526 1.5457 1.8916 2.7128 2.5427 1.3308 4.9791 2.3708 1.3447 2.1850 1.3995 2.8376 5.1452 5.8755 5.4032 1.0511 1.0548 1.0911 1.0911 1.0927 1.0932 1.0958 1.0939 1.1153 1.0997 1.1169 1.0795
irintensity: 0.3897 0.5650 0.2504 2.9720 0.5648 1.0483 0.7816 0.0829 0.5944 2.5125 0.3713 0.2096 0.4997 0.2906 22.8861 2.2371 2.8708 17.0211 1.6600 2.6971 0.6767 1.1965 46.1250 19.4360 0.3623 2.7139 50.3624 102.2341 15.3658 7.2455 9.0378 0.3604 11.6803 3.5734 3.7687 22.0801 0.5705 0.6144 5.1682 23.1915 4.2947 5.4532 2.2757 48.5106 4.9414 2.4757 0.0882 18.4373 27.7679 43.7999 10.6859 83.6702 1.8666 0.9401 18.2867 2.3719 52.0624 65.9532 16.8684 28.3735 4.2977 2.6680 1.0602 0.1505 0.7423 2.3838 4.9655 9.0874 1.3576 16.9209 1.2556 134.0263
temp: 298.150 k
press: 1.00000 atm
elementType: 6 6 6 6 6 6 1 1 1 6 1 6 6 1 1 1 7 53 6 1 1 6 1 6 1 1
symmnumber: 1
zpe: 544659.1 jmol-1
zpe.correction: 0.207450 hartree
zpe.thermalcorrener: 0.221455 hartree
zpe.thermalcorrenthalpy: 0.222399 hartree
zpe.thermalcorrgfe: 0.162482 hartree
zpe.sumelectzpe: -816.346862 hartree
zpe.sumelectthermal: -816.332857 hartree
zpe.sumelectthermalent: -816.331912 hartree
zpe.sumelectthermalfe: -816.391830 hartree
dipole: -11.2995 -1.1971 -1.7278
dipole: 11.4933
quadrupole: -39.8665 -96.7791 -85.0123
quadrupole: 7.6200 5.5930 -9.6013
quadrupole: 34.0195 -22.8931 -11.1264 7.6200 5.5930 -9.6013
hfenergy: -816.5543118 hartree
pointgroup: C01 [X(C12H12I1N1)]
dipole: -2.3428603 -3.3876678 1.865878 debye
dipolederiv: 0.0216225 -0.087833 0.1160923 -0.0584094 -0.0861711 0.2337822 0.1094615 0.2398806 -0.0132667 -0.1049913 -0.0654375 -0.0142153 -0.0868285 -0.1441247 0.0373591 -0.0289553 0.1086892 0.03478 0.1357968 -0.1110816 0.067862 0.0696386 0.3019385 -0.0981858 0.3132305 0.5193754 -0.0011756 0.1055539 0.2488975 -0.0072043 -0.2231944 -0.3009094 -0.1338257 -0.242846 -0.7337346 -0.0226585 -0.0797913 -0.16003 0.0515336 -0.0817683 -0.3373347 0.2282429 0.0255718 0.1473374 -0.0163915 0.1561938 0.4619274 -0.2601728 0.3004059 0.5116304 -0.5252006 -0.2850827 -0.6113561 0.1753214 0.3048003 0.003995 -0.0500783 -0.016379 0.1647516 -0.0222104 -0.0694405 -0.0391986 0.3297411 0.1033817 -0.0381297 -0.0050053 -0.0064326 0.0861766 -0.0132836 -0.0006317 0.0022687 0.092261 0.1144177 -0.0282141 0.0432287 -0.0455664 0.0524283 0.0397863 0.0480938 0.0073169 0.0222761 0.0993053 0.1048121 -0.1168277 0.3521747 0.5442644 -0.0367813 -0.1406638 0.0307874 0.2153433 0.099659 -0.0126775 0.0266183 -0.0067019 0.0667484 -0.0154723 0.0242624 0.0006821 0.0687804 -0.291803 -0.1829097 0.1403476 -0.1071896 -0.0754791 0.1462061 0.4061652 0.4707299 -0.3413618 0.1745601 0.0550857 -0.0753703 -0.3597113 -0.1236953 0.2509735 -0.3325732 -0.1849321 0.4329304 0.108441 0.0011241 0.0320961 -0.0046728 0.1075718 0.0208011 0.0300223 0.0060693 0.0680888 0.1365945 -0.0180508 0.0184897 -0.009824 0.0992052 -0.0007755 0.0278715 0.0139672 0.1046704 0.1449256 0.0131957 0.0126041 0.0146254 0.1411498 -0.0251922 0.0036827 -0.0295425 0.0954467 -0.1959626 0.0055775 0.0082425 0.2869014 -0.0034701 -0.1836675 0.0931304 -0.0565194 -0.311864 0.0331552 -0.1198782 0.0594042 -0.0667654 -0.0707136 0.061874 0.0592076 0.1284363 0.0159614 -0.2646207 0.0450394 -0.1852072 0.1187811 0.1141001 -0.0095455 -0.0933227 0.0362672 0.0148472 0.1055963 0.0039282 0.0919447 -0.0192213 0.0438442 0.0106285 0.0638622 -0.0338486 -0.0035532 0.1377286 -0.0294014 0.0606286 -0.0318976 0.0291931 0.000014 0.068251 0.0329743 0.0437568 -0.1317052 -0.0429083 -0.0334256 -0.0959685 -0.2530408 0.0804309 -0.1202832 0.0395782 -0.0314697 0.1251086 -0.0208225 0.0541081 -0.0239836 0.0431266 -0.0348124 0.0684781 -0.0332838 -0.0230489 -0.2751912 0.0152687 -0.1599384 0.1461852 0.0946163 0.0692598 -0.1408064 -0.009059 0.0169442 0.1100878 -0.0139864 0.0837418 -0.0053185 0.022855 -0.0576631 0.0839366 -0.0013609 -0.0036607 0.1271369 -0.0274905 0.0405027 -0.0388788 -0.0286616 -0.0227423 0.0293779 -0.0515247 0.0373017 unknown
polarizability: 144.962924|52.6142932|236.4496824|-18.0570642|-21.9421739|160.2959873 unknown
InChI: InChI=1/C9H7IN.C3H5/c10-8-3-4-9-7(6-8)2-1-5-11-9;1-3-2/h1-6,11H;3H,1-2H2
charge 1 multiplicity 2
26 atoms
C  2.0755239 2.50768705 0.52738894
C  1.48505171 1.53882621 1.28692319
C  1.3617726 0.2445572 0.75707478
C  1.82401977 -0.05884232 -0.54347766
C  2.42787429 0.97004889 -1.30514139
C  2.55291398 2.2230312 -0.77739535
H  0.460503 -0.54009633 2.41296102
H  2.1866594 3.50707729 0.92402848
H  1.12357524 1.75878872 2.28321445
C  1.67667149 -1.3751089 -1.01491267
H  2.78779944 0.7409975 -2.29890398
C  1.10556044 -2.35016687 -0.22738243
C  0.66293258 -2.01057209 1.04250924
H  2.02648694 -1.61697713 -2.01067218
H  0.99069603 -3.36574984 -0.57286693
H  0.20059959 -2.71683799 1.71636699
N  0.79196229 -0.76268179 1.48168178
I  3.47527033 3.73583843 -1.85578162
C  5.21949018 2.08361479 1.43066347
H  4.86446922 2.38945171 2.4062306
H  5.73331917 2.81919878 0.83082847
C  5.07115361 0.77771126 1.00438196
H  5.46840448 0.51507005 0.02922122
C  4.46244572 -0.20914923 1.74419848
H  4.09492931 -0.00224187 2.74169571
H  4.4111959 -1.22961214 1.39193822
