program: Gaussian 16
title: Title
version: AS64L-G16RevC.02
frameworkgroup: C1[X(C5H7B10I10)]
method: UM062X
basis: def2TZVPP
operation: Freq
keyword: #N
keyword: Geom=AllCheck
keyword: Guess=TCheck
keyword: SCRF=Check
keyword: GenChk
keyword: UM062X/def2TZVPPFreq
converged: YES YES YES YES
elementType: B
elementType: I
elementType: C
elementType: H
1716.lowfreq: -2.9117 0.0004 0.0004 0.0005 2.9857 3.9502 8.4850 16.4933 36.9906
frequency: 8.2637 16.4859 36.9902 48.7928 49.3168 52.2683 55.2167 57.4859 60.4090 60.5413 64.5399 65.4234 67.4926 72.1271 72.8363 77.3620 78.7819 81.7349 90.2232 132.6004 143.0751 148.9095 149.2837 152.2663 152.7386 154.7545 157.0401 167.4793 245.8690 295.5845 321.1650 327.8027 350.6376 365.8318 395.4359 414.8792 498.6776 532.5429 537.8127 572.0724 577.2829 588.5805 657.7741 658.5810 679.5481 684.7107 698.2225 708.7182 721.3335 735.6627 737.2468 755.5145 786.8941 803.7746 807.5733 815.2447 855.0366 858.3246 859.8277 891.7890 910.1543 911.0948 918.5292 920.8155 926.7043 945.7599 949.9564 962.6031 971.2588 976.4028 1048.3802 1085.5162 1088.5040 1120.0372 1128.5191 1145.0576 1217.9939 1255.6767 1284.3935 1335.4291 1436.0957 1465.2038 1697.3255 3037.6182 3089.5092 3164.0790 3178.0514 3226.5440 3228.9341 3256.9803
redmass: 69.6696 70.8607 47.9747 33.5717 54.3558 100.3001 12.1249 106.9640 113.2975 11.0956 37.7862 80.4172 15.2704 96.3542 95.2235 113.5924 51.4280 60.5838 34.4241 4.3325 5.0201 91.0817 92.7364 82.9710 16.1380 17.0207 48.5839 3.9433 3.8548 3.9927 6.6752 5.2176 8.8636 4.8593 6.5636 3.2588 2.6014 9.1100 10.7315 6.9144 9.1354 7.0474 2.4299 9.5041 9.1531 10.7648 9.5899 8.6092 4.4966 5.4921 9.2694 4.9628 8.3467 8.2769 9.1001 10.7279 10.7448 3.8025 3.9640 6.4963 4.1118 4.2161 5.9525 7.4494 5.5799 3.8994 3.8775 4.0162 6.7664 1.4154 1.1335 1.5032 1.7536 1.6764 1.3312 1.4978 1.3531 1.3530 1.4277 1.2583 1.1022 1.1805 4.4204 1.0607 1.0981 1.0579 1.0915 1.0924 1.0917 1.1167
irintensity: 0.0188 0.1672 0.2098 0.0239 0.0146 0.0217 0.0645 0.0047 0.0017 0.0182 0.0317 0.0237 0.3652 0.0034 0.0532 0.0061 0.0198 0.0348 0.6893 6.5166 1.4999 0.0122 0.0455 0.0060 0.0545 0.1367 0.0121 0.1693 0.5767 0.9900 2.1302 3.2273 0.2252 1.5033 7.4404 5.2336 2.3850 1.9420 0.0063 0.6822 0.0951 0.1657 14.5901 16.6151 2.2891 0.3822 1.5948 0.5558 1.1505 2.6270 2.6860 7.4560 3.9685 1.0681 0.2119 0.3867 0.6678 6.0788 31.4607 49.0779 40.7511 36.3185 22.4097 9.4123 48.7247 87.7032 90.9914 117.5287 47.3734 91.6027 15.4333 3.2290 6.6111 16.4181 7.2918 114.6190 19.9415 6.7774 6.5989 4.3181 19.7161 6.3980 130.7867 0.8217 1.3617 2.4061 2.1562 20.7738 38.0173 1.8270
temp: 298.150 k
press: 1.00000 atm
elementType: 5 5 5 5 5 5 5 5 5 5 53 53 53 53 53 53 53 53 53 6 1 6 1 6 1 6 1 1 53 1 1 6
symmnumber: 1
zpe: 419276.3 jmol-1
zpe.correction: 0.159694 hartree
zpe.thermalcorrener: 0.190341 hartree
zpe.thermalcorrenthalpy: 0.191285 hartree
zpe.thermalcorrgfe: 0.085570 hartree
zpe.sumelectzpe: -3419.854598 hartree
zpe.sumelectthermal: -3419.823952 hartree
zpe.sumelectthermalent: -3419.823007 hartree
zpe.sumelectthermalfe: -3419.928723 hartree
dipole: -3.9774 0.1822 2.9324
dipole: 4.9449
quadrupole: -362.9821 -355.4045 -350.5031
quadrupole: -0.7280 -3.5868 1.2448
quadrupole: -6.6856 0.8921 5.7935 -0.7280 -3.5868 1.2448
hfenergy: -3420.0142922 hartree
pointgroup: C01 [X(C5H7B10I10)]
dipole: -1.8447818 -0.5719026 -0.233678 debye
polarizability: 495.2038248|-25.8556935|467.9874816|-5.3042491|-8.9487637|474.4017562 unknown
InChI: InChI=1/C5H7B10I9.I/c1-2-3-6-9(18)4-5-7(4,9,16)11(5,20)12(5,21)8(4,5,17)10(4,6,9,19)14(6,8,12,23)15(6,11,12,24)13(6,7,9,11)22;/h2,4-5H,1,3H2;
charge 0 multiplicity 2
32 atoms
B  0.10415113 -1.47965667 0.3237538
B  1.09482288 -0.05612401 -0.13888509
B  0.06779928 0.96956923 -1.20382578
B  -1.29485746 -0.92489732 1.28117761
B  -1.20464052 0.8535968 1.39647351
B  0.25757473 1.39351929 0.52440512
B  -0.02861403 -0.80287495 -1.32111392
B  -1.51332909 0.18195365 -1.41122732
B  -1.34081541 1.53430429 -0.26035867
B  0.28553656 -0.1292145 1.46648595
I  0.82488178 -3.46411117 0.63340731
I  0.9004882 2.13242715 -2.79171099
I  -2.40359655 -2.15811781 2.60781328
I  -2.14048046 1.81114699 3.05213834
I  1.215582 3.19412702 1.18408141
I  0.52767939 -1.96121524 -3.02465063
I  -2.86454035 0.16917607 -3.04948551
I  -2.44406539 3.31967949 -0.61833242
I  1.40175627 -0.36828418 3.27434576
C  -2.12952414 0.10234011 0.18925904
H  -3.20713977 0.064674 0.26104458
C  2.65975642 -0.27176773 -0.36169035
H  2.93248871 -1.18951149 0.17133341
C  3.56452028 0.82751619 0.09036212
H  3.5930427 1.02554436 1.15709948
C  4.33004294 1.55120767 -0.72614592
H  4.96454626 2.34154537 -0.34848992
H  4.31611592 1.3893562 -1.79740718
I  6.39167508 -0.76160348 -0.12315992
H  2.83002896 -0.4666913 -1.42422558
H  -2.03314929 -2.03142022 -0.69633298
C  -1.39617623 -1.20708648 -0.40900135
