program: Gaussian 16
title: Title
version: AS64L-G16RevC.02
frameworkgroup: C1[X(C9H9BF3I)]
method: UM062X
basis: def2TZVPP
operation: Freq
keyword: #N
keyword: Geom=AllCheck
keyword: Guess=TCheck
keyword: SCRF=Check
keyword: GenChk
keyword: UM062X/def2TZVPP
keyword: Freq
converged: YES YES NO NO
elementType: C
elementType: H
elementType: I
elementType: B
elementType: F
1716.lowfreq: -106.5325 -3.9654 -0.0004 -0.0000 0.0007 2.6606 4.9338 6.2952 11.1053
frequency: -106.5321 5.1329 10.4480 27.4193 42.2031 63.4282 72.9795 110.8265 114.7731 162.2264 206.8585 280.0995 287.6665 328.0410 347.1611 414.2054 438.4767 448.3311 492.8881 553.0098 601.7022 617.2289 684.5249 688.5324 706.1913 767.2304 801.5659 905.0565 912.9389 943.5516 957.1692 963.0249 984.9272 1004.9957 1019.2482 1059.4686 1064.0360 1075.4063 1086.4452 1096.7661 1116.6474 1163.9471 1179.6537 1217.2650 1276.0362 1292.8057 1326.8623 1431.0706 1441.1475 1484.5747 1486.7234 1564.1234 1649.1856 1707.4286 3128.9360 3160.8923 3169.5070 3171.8573 3190.8672 3203.7056 3203.9903 3206.8689 3250.5593
redmass: 12.8957 12.9853 4.2702 5.8945 3.0803 9.5360 5.2919 3.6809 6.9592 6.8765 2.9101 6.6584 9.1072 6.1753 3.2212 3.8254 6.9536 2.0049 12.9892 6.2369 9.8897 6.5910 2.2298 1.7570 7.0918 1.4294 1.3098 1.4725 1.2786 1.3442 2.1868 4.1659 1.3307 4.9265 1.1914 2.3330 1.3019 2.4921 11.4400 1.2021 3.2583 1.7292 1.5310 1.6740 3.1569 1.6427 1.2693 2.6069 1.1505 2.4473 1.1836 5.9893 7.1758 4.4733 1.0557 1.0588 1.0852 1.0914 1.0920 1.1099 1.0898 1.0936 1.1161
irintensity: 17.0255 0.1779 0.5781 0.3981 0.6486 1.0799 0.0080 0.1237 0.0095 0.2821 0.8554 0.3295 7.9255 2.3855 22.1762 0.4307 2.8170 2.0886 0.3046 0.0404 10.5344 32.5356 13.5216 18.0159 1.6810 41.3273 4.7348 16.3922 4.2819 51.1133 52.6505 124.6859 0.0706 270.4897 1.9708 14.2613 5.9966 176.2574 270.7588 22.3572 108.2553 168.6183 222.8950 17.5892 10.0144 4.3326 0.8126 8.5666 3.9933 1.0944 3.2852 57.9466 1.2684 41.2771 10.3983 6.3554 13.1900 7.2704 25.2403 4.3341 0.6232 18.9100 13.4084
temp: 298.150 k
press: 1.00000 atm
elementType: 6 6 6 6 6 6 1 1 53 6 1 1 6 1 6 1 1 1 1 5 9 9 9
symmnumber: 1
zpe: 420911.1 jmol-1
zpe.correction: 0.160317 hartree
zpe.thermalcorrener: 0.175256 hartree
zpe.thermalcorrenthalpy: 0.176200 hartree
zpe.thermalcorrgfe: 0.110114 hartree
zpe.sumelectzpe: -970.394450 hartree
zpe.sumelectthermal: -970.379511 hartree
zpe.sumelectthermalent: -970.378567 hartree
zpe.sumelectthermalfe: -970.444653 hartree
dipole: -15.7074 2.7072 -0.2250
dipole: 15.9406
quadrupole: -188.5651 -109.3308 -110.7297
quadrupole: 15.7065 -0.7017 0.2302
quadrupole: -52.3566 26.8777 25.4788 15.7065 -0.7017 0.2302
hfenergy: -970.5547668 hartree
pointgroup: C01 [X(C9H9B1F3I1)]
dipole: 5.5256362 -2.8245329 -0.9062488 debye
dipolederiv: -0.8599667 0.2810096 0.0642213 -0.2244433 0.0017311 0.0200088 -0.1819155 0.0705717 -0.0662602 -0.186687 0.046365 0.0219181 0.5456554 -0.3508502 -0.0443239 0.2828678 -0.0967564 -0.1825269 0.0430434 0.003015 0.0152935 0.0651223 -0.1530384 -0.0051831 0.0512293 -0.0101487 -0.1353468 0.2462449 0.0163363 0.0454908 -0.1487332 0.0435543 0.0899413 -0.0479201 0.1073781 -0.1062284 -0.7016598 -0.0132381 -0.0698615 0.1066469 -0.1285845 0.0193169 0.0128339 0.0050362 -0.1349896 0.60025 -0.1113461 0.0188077 -0.0028114 0.070678 0.0731172 0.0502178 0.0596959 -0.0311604 0.1266536 -0.0842339 -0.0420072 -0.0904672 0.0727162 -0.0324244 -0.0470534 -0.0306749 0.0969554 0.0764483 0.0805607 0.0388658 0.0554249 0.0095353 -0.0642164 0.0254492 -0.0610206 0.1089189 1.0331983 -0.0094495 0.0879224 0.049855 -0.2210996 -0.0074001 0.0741414 0.0236899 -0.1696968 -0.1146901 0.0218339 0.0119954 0.1400425 0.0044218 0.018843 -0.1215443 0.0318449 0.0607425 -0.0851237 -0.0136804 -0.0340853 0.019434 -0.0225236 -0.0461466 -0.062544 -0.0421258 0.0110204 -0.1497237 -0.0138842 0.0411932 0.0207724 0.0133172 0.0102885 0.020881 0.0596863 -0.0275138 -0.1417789 -0.1822109 -0.152532 -0.7414122 0.2366442 -0.0387005 0.0198537 -0.0589423 0.0532372 0.102711 0.0215961 0.062183 0.060471 0.0227759 0.0516769 0.0047901 0.0601687 -0.0514754 -0.4535842 0.0236839 -0.0487816 0.2999413 -0.1375966 -0.1096989 0.0053481 -0.1692697 -0.0176802 0.0807205 0.0366 0.0306536 -0.0089721 0.0266059 0.0892358 0.0457571 0.043557 -0.0538217 0.1653226 0.0449713 0.0279497 0.1541049 -0.0737495 0.0307854 0.0631349 0.047068 0.0490855 -0.073081 -0.0703713 -0.0566138 -0.0757902 -0.0739279 -0.1110661 -0.0579291 -0.1100217 0.0584596 -0.1209595 -0.0203207 -0.032687 -0.0259613 0.0887265 -0.0201221 -0.0336134 -0.0192053 0.1088704 1.9219556 -0.3699757 -0.1515498 -0.797079 1.9243595 0.1419675 -0.385229 0.1895288 1.5642812 -0.6244206 -0.1239562 -0.0826262 0.0624582 -0.9724307 -0.2725039 0.0172997 -0.2925212 -0.5934265 -0.8837111 0.3562664 -0.1796007 0.4756629 -0.7861242 0.1452077 -0.2670795 0.216312 -0.738665 -1.0011619 0.0804286 0.3838505 0.0600781 -0.5951408 0.0613971 0.5310243 -0.023851 -0.8027792 unknown
polarizability: 290.2341988|-37.1274742|149.351396|0.9431415|20.6059616|113.9035891 unknown
InChI: InChI=1/C6H4BF3.C3H5I/c8-7(9,10)6-4-2-1-3-5-6;1-2-3-4/h1-2,4-5H;2H,1,3H2
charge -1 multiplicity 2
23 atoms
C  -1.25595893 1.80607555 0.36989561
C  -2.65327665 1.78532288 0.23717393
C  -3.2256499 0.67938463 -0.39834905
C  -2.46924307 -0.37525131 -0.89088378
C  -1.07732492 -0.35922154 -0.76131966
C  -0.55725225 0.74036982 -0.13283485
H  -0.77742492 2.64641904 0.85653781
H  -0.45720932 -1.16388277 -1.1334947
I  2.06476004 0.74676321 0.12187656
C  4.30734211 0.79404882 0.28721224
H  4.46458478 1.50174434 1.0941734
H  4.64941344 1.1927943 -0.66221882
C  4.8158476 -0.55594833 0.57317225
H  4.58994703 -0.95327482 1.55766041
C  5.48869988 -1.30561437 -0.29455805
H  5.71349015 -0.94360751 -1.29074921
H  5.82309881 -2.30210949 -0.04094767
H  -2.94772559 -1.21741007 -1.37860431
H  -4.30407322 0.65388928 -0.5062161
B  -3.58398491 3.01373781 0.80617445
F  -2.76960089 3.99451414 1.39871366
F  -4.31172404 3.58292327 -0.25508391
F  -4.4906891 2.51442631 1.75928649
