program: Gaussian 16
title: Title
version: AS64L-G16RevC.02
frameworkgroup: C1[X(C9H9BF3I)]
method: UM062X
basis: def2TZVPP
operation: Freq
keyword: #N
keyword: Geom=AllCheck
keyword: Guess=TCheck
keyword: SCRF=Check
keyword: GenChk
keyword: UM062X/def2TZVPP
keyword: Freq
converged: YES YES YES YES
elementType: C
elementType: H
elementType: I
elementType: B
elementType: F
1716.lowfreq: -0.6592 -0.0006 0.0006 0.0009 2.2654 7.8576 8.6530 12.5425 18.4528
frequency: 8.0689 12.2845 18.3423 20.4794 55.1765 67.4708 88.4470 112.0872 123.2889 149.6477 242.0114 279.9842 289.6574 331.2901 382.5061 412.9454 434.6641 492.2390 519.4805 554.7028 603.0525 629.0548 690.6198 694.0322 709.8160 771.9623 851.5878 907.4417 913.5941 956.4423 968.0179 980.8776 987.3739 1009.4241 1030.9823 1060.9945 1073.5544 1083.9942 1085.0366 1112.9320 1165.4690 1185.2151 1189.2032 1218.9093 1277.0436 1293.3702 1330.8748 1426.9426 1444.5993 1482.9035 1485.3789 1568.8085 1647.1030 1728.0688 3141.4615 3164.3616 3165.0240 3178.7011 3181.3959 3187.0423 3195.9845 3214.9702 3255.7244
redmass: 17.0248 8.3995 4.7280 5.8409 7.1196 4.0851 3.1213 6.8043 3.3102 7.1489 2.4700 6.5457 9.6265 10.2853 2.4923 3.6668 7.5944 13.3918 2.1373 6.1256 10.0708 7.4274 1.7431 2.1707 10.0994 1.5183 1.3419 1.4213 1.3245 1.8212 9.5727 1.3475 1.3276 5.2256 1.0986 2.3352 2.4901 11.3145 1.3109 3.1233 1.4098 1.9628 1.2211 1.5617 2.5144 1.9246 1.2625 2.7117 1.1358 1.4333 1.7222 6.0822 6.9296 4.7663 1.0573 1.0588 1.0847 1.0929 1.0881 1.0899 1.0951 1.1101 1.1167
irintensity: 0.0367 2.2481 0.1362 1.2427 0.5572 2.1760 1.2900 0.0965 0.5154 0.3205 2.6874 0.6301 7.9979 1.5423 2.9006 0.7329 2.4708 0.1091 22.7084 0.2811 14.0783 4.6826 51.2946 22.6689 2.0128 38.6086 3.9375 8.8086 9.3047 2.5826 242.9745 48.6749 0.1812 107.1099 11.4539 61.7370 91.9728 268.0228 8.0093 109.3749 50.1201 188.3809 67.8323 5.1445 7.4197 7.5453 0.5518 6.7706 3.9048 8.6576 2.2610 5.2545 1.3919 2.4869 2.4348 3.3827 13.9017 4.8039 6.1213 23.2853 29.4095 0.5101 8.2586
temp: 298.150 k
press: 1.00000 atm
elementType: 6 6 6 6 6 6 1 1 6 1 6 1 6 1 1 53 1 1 1 5 9 9 9
symmnumber: 1
zpe: 423741.9 jmol-1
zpe.correction: 0.161395 hartree
zpe.thermalcorrener: 0.176984 hartree
zpe.thermalcorrenthalpy: 0.177928 hartree
zpe.thermalcorrgfe: 0.109295 hartree
zpe.sumelectzpe: -970.398373 hartree
zpe.sumelectthermal: -970.382785 hartree
zpe.sumelectthermalent: -970.381840 hartree
zpe.sumelectthermalfe: -970.450473 hartree
dipole: -15.5956 5.6581 -0.4014
dipole: 16.5951
quadrupole: -199.4757 -116.0036 -111.5135
quadrupole: 21.7613 0.0615 0.4794
quadrupole: -57.1447 26.3273 30.8174 21.7613 0.0615 0.4794
hfenergy: -970.5597682 hartree
pointgroup: C01 [X(C9H9B1F3I1)]
dipole: -6.1865112 2.0864854 0.040578 debye
dipolederiv: -0.3021337 0.1630695 -0.0033744 -0.0467562 0.0088309 -0.0064676 0.0117419 -0.0113994 -0.0954089 -0.193445 0.0712045 -0.0085307 0.2240317 -0.2710652 -0.0026239 -0.0105328 -0.0042923 -0.1688557 0.0708895 0.0188323 -0.0060962 0.1371829 -0.1736134 0.0044388 -0.0278965 0.0060697 -0.137346 0.1875729 0.0218852 -0.0102458 0.0039507 0.0934269 -0.02922 -0.0010005 -0.0264558 -0.1597629 -0.254169 -0.0735131 0.0219585 -0.0560962 -0.1018281 -0.0076551 0.0357152 -0.0058798 -0.150477 -0.0302448 -0.0378192 -0.012179 -0.0402763 0.048652 -0.0188245 0.0037714 -0.0161629 -0.1163341 0.0882973 -0.087374 0.0079128 -0.1130982 0.0036233 0.0202277 0.0073391 0.0153591 0.113813 0.0164949 0.1095939 -0.0128045 0.1308746 -0.0369462 0.0164881 -0.0334251 0.0088609 0.1309751 -0.1345648 -0.017478 0.131797 -0.1720329 -0.0873173 -0.0304263 0.1661902 -0.04701 -0.1323282 0.0883955 -0.0083688 -0.0952844 0.046047 0.017206 0.0437745 -0.0971393 0.0367725 0.0562424 -0.2570549 -0.2018281 0.1767157 0.0373998 0.0987055 0.0229371 0.1523936 -0.0180306 0.0008784 0.0650973 0.0434784 -0.098779 0.0161242 0.0152764 0.0053118 -0.1006798 0.0188062 0.0117347 0.7053889 0.5094675 -0.1390915 0.4804445 0.4432049 -0.0286276 -0.1487799 -0.0971647 -0.0095919 -0.0124465 -0.0560789 0.0565987 -0.0902566 -0.0545195 0.0081373 0.0661057 0.0063179 0.0410513 -0.028813 -0.0383709 -0.0253498 -0.0968629 -0.0265235 -0.0122931 -0.0273889 0.0377401 0.0418624 -0.4571099 -0.2676137 0.0134402 -0.2131606 -0.3787178 -0.0060392 0.0549881 0.0677562 -0.1430389 0.1151669 0.0619607 -0.0364848 0.0241886 -0.0835962 -0.0080933 -0.0879021 -0.0019319 0.0905114 -0.0015613 -0.089648 0.0167423 -0.0773817 -0.1534569 0.0365694 0.0139964 0.0349005 0.1158186 -0.114545 -0.0488365 0.012343 -0.041715 0.0701156 0.0090902 0.0098338 0.0086787 0.1203841 1.8049516 -0.3446752 0.028414 -0.5408887 1.8238248 -0.0243561 0.0655101 -0.0423922 1.5007597 -0.6139088 -0.1215844 -0.0144578 -0.0211446 -1.1022282 0.0027956 -0.0173536 0.0081072 -0.4423831 -0.9399749 0.2156517 0.3119637 0.2210471 -0.5799522 -0.0377086 0.3626226 -0.0825754 -0.7634098 -0.8022831 0.1780452 -0.3152082 0.1883789 -0.5731015 0.0425647 -0.3981096 0.1039258 -0.9050945 unknown
polarizability: 192.7635819|17.4480552|174.2268472|-2.0719247|-2.1001604|105.0509 unknown
InChI: InChI=1/C6H4BF3.C3H5I/c8-7(9,10)6-4-2-1-3-5-6;1-2-3-4/h1-2,4-5H;2H,1,3H2
charge -1 multiplicity 2
23 atoms
C  1.90817977 -0.01679522 -0.0350575
C  3.30309228 0.12759617 -0.08769153
C  3.80628489 1.42159473 -0.25820905
C  2.98457536 2.53571594 -0.37008831
C  1.59546394 2.38932126 -0.31344532
C  1.13263707 1.10955007 -0.14857577
H  1.48690994 -1.00807277 0.08890132
H  0.92952881 3.23928074 -0.3997249
C  -1.76549338 2.64064791 0.78689825
H  -1.07964179 2.36289145 1.57787423
C  -2.25705774 1.73300498 -0.04367754
H  -2.92509904 2.02720525 -0.84570973
C  -1.92452727 0.29152248 0.04267572
H  -1.53931597 -0.11722134 -0.88557907
H  -1.25164852 0.05940015 0.85994014
I  -3.72619551 -0.86677606 0.4146351
H  -2.00975482 3.68912602 0.68147251
H  3.41364842 3.52319068 -0.50241633
H  4.88181382 1.54931929 -0.30779365
B  4.30495511 -1.16255407 0.06015733
F  3.55692237 -2.35434757 0.0274998
F  5.23885094 -1.16207162 -0.99314388
F  5.00195633 -1.08444549 1.2812162
