program: Gaussian 16
title: Title
version: AS64L-G16RevC.01
frameworkgroup: C1[X(C8H8B12I11)]
method: UM062X
basis: def2TZVPP
operation: Freq
keyword: #N
keyword: Geom=AllCheck
keyword: Guess=TCheck
keyword: SCRF=Check
keyword: GenChk
keyword: UM062X/def2TZVPP
keyword: Freq
converged: YES YES YES YES
elementType: B
elementType: I
elementType: C
elementType: H
1716.lowfreq: -125.7479 -0.5162 -0.0005 0.0003 0.0003 0.8517 3.8800 12.7495 24.1566
frequency: -125.7476 12.7243 24.1403 34.7132 45.5992 53.1474 54.0250 55.6104 56.7153 59.1487 60.6097 62.5393 63.3053 67.2350 67.7064 70.0100 70.4722 70.9361 71.5662 74.2878 74.4031 75.3168 82.3152 82.9831 87.2218 143.3253 143.6388 143.7363 144.3291 144.3660 147.0401 149.6703 150.7727 150.9266 242.8762 280.2231 327.1466 341.4590 343.1481 363.9828 376.9931 378.0413 417.5549 450.3584 478.9825 561.4686 592.2040 593.8455 594.3317 595.1177 599.7935 600.4623 633.1716 680.6465 682.5205 683.0897 683.4287 690.8890 717.6656 755.4945 755.8394 762.4226 763.1982 779.4787 799.1425 808.2140 820.3042 821.2919 838.8988 839.4902 843.5860 845.1408 865.2674 884.3508 926.6330 927.8031 928.4071 938.1850 939.6064 941.8896 945.1068 955.3324 958.1720 962.5030 990.3540 1006.2131 1018.3392 1021.0246 1045.0296 1066.1951 1119.1954 1169.6585 1205.9723 1240.1692 1313.9575 1335.8015 1361.7689 1449.5083 1490.9094 1540.6198 1637.7528 1662.8813 1674.3370 3161.4547 3173.8940 3181.6946 3192.0997 3201.7631 3211.8874 3222.2550 3250.9136
redmass: 5.9025 6.7929 6.7526 6.9309 6.8153 33.7489 65.2370 30.4436 47.9945 40.9316 35.8209 32.3087 37.0288 41.0757 26.6880 88.7191 55.3167 72.7673 56.2764 65.7646 55.5906 13.7054 66.4835 63.5147 31.3028 17.3332 108.5567 108.5125 109.6594 110.3863 5.2292 50.1539 112.7210 99.2753 2.6726 2.6761 11.6151 11.2347 10.6199 11.1774 12.5601 12.5033 2.8969 3.6664 2.5723 3.2038 9.8109 10.5018 10.9845 10.9845 10.9404 10.9853 6.3675 7.5562 10.9740 10.8702 11.0584 2.4838 1.2593 11.0062 11.0127 10.7319 10.8696 8.6111 3.6354 2.0293 11.0077 10.9714 11.0167 10.7528 10.5786 10.7970 1.2644 6.2013 10.9678 10.9302 8.3967 1.6395 5.2940 8.7274 4.7394 5.3618 10.7511 2.3098 1.3085 1.3723 1.3239 3.6595 1.5657 1.8653 1.5035 1.1282 1.1366 2.4377 2.3802 1.9876 1.3340 1.3455 2.1737 2.3474 4.5292 4.8395 5.3914 1.0592 1.0895 1.0841 1.0880 1.0922 1.0957 1.0949 1.1153
irintensity: 4.1618 0.0053 0.1137 0.0372 0.0456 0.0376 0.0096 0.0167 0.0057 0.0073 0.0195 0.0099 0.0041 0.0132 0.0243 0.0020 0.0056 0.0382 0.0020 0.0164 0.0393 0.1677 0.6008 0.6770 0.2026 1.0099 0.0232 0.0371 0.0018 0.0149 0.9489 0.0740 0.0005 0.0085 0.5329 0.0472 4.1850 1.2178 1.1835 0.0092 18.6975 17.6917 0.0143 4.7210 11.2809 5.3971 19.7263 7.0510 0.4652 0.4802 0.1634 0.3642 0.1290 0.2647 0.1316 0.4586 0.0329 5.8730 43.8978 0.0323 0.0091 0.0864 0.0670 11.6602 2.7194 30.6723 0.0205 0.0147 0.0331 0.0305 1.0207 0.8718 1.4829 11.7228 0.2659 0.3633 5.4457 6.0564 15.2363 17.2601 119.1606 158.2653 224.2174 88.3958 0.1439 0.1173 23.1288 1.7161 12.4557 2.9053 4.2323 0.0359 2.6834 4.1724 3.3496 4.9752 2.9623 24.1409 2.3522 25.2274 10.8585 51.0209 13.6877 1.1789 4.0834 3.2863 8.0602 27.4801 43.7323 7.1920 0.9930
temp: 298.150 k
press: 1.00000 atm
elementType: 5 5 5 5 5 5 5 5 5 5 53 53 53 53 53 53 53 53 53 6 1 6 1 1 5 53 5 53 6 6 6 6 1 6 1 6 1 1 1
symmnumber: 1
zpe: 521902.9 jmol-1
zpe.correction: 0.198782 hartree
zpe.thermalcorrener: 0.234735 hartree
zpe.thermalcorrenthalpy: 0.235679 hartree
zpe.thermalcorrgfe: 0.118503 hartree
zpe.sumelectzpe: -3882.376942 hartree
zpe.sumelectthermal: -3882.340989 hartree
zpe.sumelectthermalent: -3882.340045 hartree
zpe.sumelectthermalfe: -3882.457222 hartree
dipole: 0.9364 0.0448 -0.0397
dipole: 0.9383
quadrupole: -500.5695 -478.4027 -482.1090
quadrupole: -0.0412 -2.6367 -0.3993
quadrupole: -13.5424 8.6243 4.9180 -0.0412 -2.6367 -0.3993
hfenergy: -3882.5757243 hartree
pointgroup: C01 [X(C8H8B12I11)]
dipole: 0.3680562 -0.0193825 -0.0209575 debye
polarizability: 690.268573|-15.3939825|574.6776987|-13.9136227|-6.862264|551.332538 unknown
InChI: InChI=1/C8H8.B12I11/c1-2-8-6-4-3-5-7-8;13-2-1-3(2,14)5(1,16)6(1,17)4(1,2,15)8(2,19)7(2,3,18)9(3,5,20)11(5,6,22)10(4,6,8,21)12(7,8,9,11)23/h2-7H,1H2;
charge -2 multiplicity 2
39 atoms
B  0.32350651 1.73383816 0.07095081
B  1.09522593 0.43080756 0.9174105
B  -0.06112172 -0.72165274 1.50095032
B  -0.05510127 -0.72583178 -1.38073683
B  0.92226566 -1.07146212 0.06747134
B  -0.43396461 1.01143288 1.50220256
B  -1.42242515 1.37448706 0.06586185
B  -1.66234095 -0.15824306 0.95844579
B  -0.81762035 -1.45600144 0.06423793
B  1.16315662 0.44831373 -0.81621752
I  1.09565066 3.774165 0.10689198
I  0.23777331 -1.81349232 3.36474853
I  0.19214544 -1.83830707 -3.22218537
I  2.45115904 -2.62278434 0.09228764
I  -0.65458057 2.12681101 3.36443164
I  -2.9165852 2.94262331 0.06699153
I  -3.46248729 -0.54604891 2.09928928
I  -1.54330778 -3.49660345 0.06754819
I  3.00427902 0.83563225 -1.91432905
C  3.10435583 1.27846162 2.37540675
H  2.35674727 2.03118249 2.58857401
C  4.13405898 1.56016922 1.56576094
H  4.14054511 2.5224997 1.06389932
H  3.02800762 0.35166318 2.93181948
B  -0.42810982 1.02310025 -1.37912849
I  -0.65760942 2.14289009 -3.21879201
B  -1.65086995 -0.15330164 -0.82577256
I  -3.45148104 -0.53535577 -1.96649949
C  5.25464848 0.67635703 1.24568745
C  5.31655973 -0.65404703 1.67287054
C  6.30951022 1.16455969 0.46876036
C  6.39860718 -1.45352263 1.34728504
H  4.4932773 -1.0755254 2.23371296
C  7.39577483 0.36658297 0.14616947
H  6.25761601 2.18375657 0.1049429
C  7.44833433 -0.94877626 0.58792752
H  6.41160666 -2.48648848 1.67118087
H  8.19615753 0.76774156 -0.46314223
H  8.28776985 -1.58074691 0.32748008
