program: Gaussian 16
title: Title
version: ES64L-G16RevC.02
frameworkgroup: C1[X(CHB11I10)]
method: UM062X
basis: def2TZVPP
operation: Freq
keyword: #N
keyword: Geom=AllCheck
keyword: Guess=TCheck
keyword: SCRF=Check
keyword: GenChk
keyword: UM062X/def2TZVPP
keyword: Freq
converged: YES YES NO YES
elementType: B
elementType: I
elementType: C
1716.lowfreq: -3.3921 -2.3704 0.0005 0.0005 0.0005 1.6171 47.1608 47.3113 51.7239
frequency: 47.1593 47.3062 51.7236 53.8400 54.1716 59.6316 60.1583 61.0527 66.0295 66.3632 69.4759 69.6502 79.1021 79.5689 80.8082 81.1037 85.9017 146.6399 146.7543 147.3951 147.4870 148.4677 154.0082 154.1364 312.1767 316.6737 317.0179 360.0453 375.4912 376.1556 557.7923 558.5962 579.6304 592.3817 592.6532 597.3249 682.3420 682.9137 700.9577 701.5373 738.6388 738.9090 753.8831 754.0357 786.7336 821.0065 821.0984 827.2881 827.7535 851.7965 852.8019 894.2999 922.6408 923.2213 929.5510 930.1685 943.1955 955.7355 956.5421 965.0554 1127.5088 1128.9018 3221.5247
redmass: 125.8100 125.8029 126.0267 126.6070 126.6495 126.4780 126.5142 125.6394 123.8218 123.7514 126.7101 126.7781 124.9269 122.5067 70.5785 72.5409 51.2343 101.6801 101.6492 106.5988 106.5715 112.0211 114.3650 114.3793 12.5754 8.4329 8.4577 11.1838 11.6492 11.6393 11.0332 11.0333 9.6323 8.6642 8.6705 11.0114 11.1330 11.1333 10.9908 10.9866 11.0189 11.0201 8.8103 8.8120 9.6974 11.0091 11.0093 10.6139 10.6026 11.1101 11.1107 8.7248 4.9184 4.8919 11.0072 11.0091 10.1488 8.2111 8.2137 10.8431 1.3409 1.3351 1.0903
irintensity: 0.0000 0.0000 0.0000 0.0000 0.0000 0.0001 0.0000 0.0003 0.0003 0.0001 0.0000 0.0000 0.0022 0.0054 0.1461 0.1377 0.0187 0.0262 0.0256 0.0008 0.0007 0.0051 0.0000 0.0001 1.3966 0.1139 0.1478 0.0131 14.4559 14.3273 0.0002 0.0007 6.3212 1.0958 1.0811 0.0009 0.0009 0.0013 0.2014 0.2054 0.0051 0.0002 4.7833 4.7404 50.8860 0.0005 0.0013 0.0328 0.0097 0.0108 0.0137 50.5873 56.1046 57.0179 0.2529 0.2482 121.2032 171.2563 170.0621 24.2457 59.8228 58.1447 16.4344
temp: 298.150 k
press: 1.00000 atm
elementType: 5 5 5 5 5 5 5 5 5 5 5 53 53 53 53 53 53 53 53 53 53 6 1
symmnumber: 1
zpe: 198184.8 jmol-1
zpe.correction: 0.075485 hartree
zpe.thermalcorrener: 0.101549 hartree
zpe.thermalcorrenthalpy: 0.102493 hartree
zpe.thermalcorrgfe: 0.009414 hartree
zpe.sumelectzpe: -3288.969533 hartree
zpe.sumelectthermal: -3288.943469 hartree
zpe.sumelectthermalent: -3288.942525 hartree
zpe.sumelectthermalfe: -3289.035604 hartree
dipole: 0.0000 0.0022 2.6524
dipole: 2.6524
quadrupole: -372.8970 -372.8970 -360.1917
quadrupole: 0.0014 -0.0006 -0.0017
quadrupole: -4.2351 -4.2351 8.4702 0.0014 -0.0006 -0.0017
hfenergy: -3289.0450179 hartree
pointgroup: C01 [X(C1H1B11I10)]
dipole: -0.0004068 0.0007803 -1.0435497 debye
dipolederiv: 0.1046368 0.4272013 -0.2911191 0.4271455 0.334743 -0.3786359 -0.2403971 -0.3102087 0.0979729 -0.2518045 -0.0001894 -0.000003 0.0001577 -0.2542392 -0.0001619 0.0002441 -0.0008855 -0.3092313 0.5916345 0.239948 0.4558198 0.240773 -0.14957 0.1346077 0.3771016 0.1108043 0.0975311 0.5792074 0.1997882 0.4592605 0.1994663 -0.0317684 0.1364424 0.4162926 0.123318 0.2312715 0.1408215 -0.3425597 0.2722668 -0.3409917 0.4044922 -0.3955926 0.2460252 -0.3582498 0.2325469 -0.2214496 0.0235141 0.0127622 0.0227089 0.6605759 0.4765846 0.0098793 0.3921002 0.0978658 0.0627228 -0.4128866 0.2696628 -0.4137345 0.3798695 -0.3928261 0.2219682 -0.3238469 0.0977427 -0.0918019 0.0190913 0.0136027 0.018263 0.6361657 0.4816073 0.010849 0.4332867 0.23254 0.5567552 -0.2301799 -0.4551505 -0.2297676 -0.010992 0.1624711 -0.4084818 0.1454228 0.2321709 0.1785063 0.3542683 -0.2926436 0.3538717 0.3668623 -0.3827217 -0.2643656 -0.3427472 0.2318347 0.5641083 -0.2786479 -0.4498424 -0.2793049 -0.1245643 0.1597194 -0.3721217 0.1312296 0.0960572 -0.2530872 -0.2303818 0.1212198 -0.2307675 -0.3763116 0.157131 0.1351089 0.175404 -0.1824344 -0.514331 -0.1285122 -0.1893339 -0.1297378 -0.114313 -0.0570182 -0.2128466 -0.0631164 -0.1818407 -0.4320385 -0.1129002 -0.2041072 -0.1130115 -0.0861931 -0.0607039 -0.2443544 -0.0728136 -0.2121673 -0.1846151 0.1949799 -0.1220549 0.1942286 -0.3328203 0.17661 -0.1452186 0.2112151 -0.2138431 -0.077141 -0.0129658 -0.0053811 -0.0123126 -0.5522528 -0.1981051 -0.0057271 -0.2208209 -0.1816771 -0.2305076 0.2221639 -0.1114885 0.2226166 -0.4017174 0.1630088 -0.125627 0.1832055 -0.1824142 -0.0525349 -0.0110815 -0.0063347 -0.0104649 -0.4667202 -0.2140421 -0.0070006 -0.2560566 -0.2143546 -0.4203462 0.1302377 0.2019154 0.1305798 -0.0978109 -0.0722441 0.2406783 -0.0860731 -0.2158981 -0.2061255 -0.2015419 0.1309398 -0.2013128 -0.3128433 0.1712073 0.1558339 0.2038183 -0.2149348 -0.5016279 0.1506429 0.1876119 0.1510714 -0.1299623 -0.0672192 0.2105277 -0.0752142 -0.1818114 -0.3849097 0.0001385 0.0011641 0.0005965 -0.3830558 0.0000395 0.0014398 0.0003086 -0.4541408 0.0439275 -0.0001273 0.0012332 -0.0000733 0.042426 -0.0001584 0.0001923 -0.0000803 0.0972141 unknown
polarizability: 478.369264|0.0705239|478.3056374|0.0601021|0.0141407|399.9178136 unknown
InChI: InChI=1/CHB11I10/c13-3-1-4(3,14)6(1,16)7(1,17)5(1,3,15)9(3,19)2-8(3,4,9,18)10(2,4,6,20)12(2,6,7,22)11(2,5,7,9)21/h1H
charge -1 multiplicity 2
23 atoms
B  -0.92346866 -1.20295581 0.82962954
B  0.00003597 -0.00008658 1.68670868
B  1.45418463 0.43040234 0.82977943
B  -1.45786368 -0.43125132 -0.68201858
B  -0.86082448 1.25342311 -0.68180996
B  0.04018543 1.51609891 0.83005976
B  0.85868122 -1.24985654 0.82970066
B  -0.04012285 -1.51944255 -0.68234342
B  1.43281131 -0.50741848 -0.68224062
B  0.92577105 1.20608297 -0.68203668
B  -1.42942286 0.50660656 0.83005277
I  -2.10058061 -2.73790372 1.78270382
I  3.30920154 0.97856705 1.78236022
I  -3.21960441 -0.9535131 -1.78934835
I  -1.90147992 2.76758753 -1.78949947
I  0.0912534 3.44935604 1.78370729
I  1.95404783 -2.84428355 1.78287179
I  -0.0885413 -3.35644153 -1.78973671
I  3.16480087 -1.12114936 -1.78965238
I  2.04509445 2.66340755 -1.78983274
I  -3.25272606 1.15190388 1.78282897
C  -0.00032255 0.00039501 -1.45730537
H  -0.00082732 0.00079758 -2.53820766
