program: Gaussian 16
title: Title
version: AS64L-G16RevC.01
frameworkgroup: C1[X(CB11I11)]
method: UM062X
basis: def2TZVPP
operation: Freq
keyword: #N
keyword: Geom=AllCheck
keyword: Guess=TCheck
keyword: SCRF=Check
keyword: GenChk
keyword: UM062X/def2TZVPP
keyword: Freq
converged: YES YES NO YES
elementType: B
elementType: I
elementType: C
1716.lowfreq: -1.8010 0.0007 0.0009 0.0010 2.1060 3.4167 46.8873 47.0595 52.2406
frequency: 46.8850 47.0574 52.2404 56.2431 56.3139 59.2905 59.5340 63.9424 66.1178 66.6047 67.8030 67.9531 68.8204 69.0070 80.0315 80.1159 83.1362 83.1702 84.1886 146.4614 146.5357 147.1023 147.1655 149.0538 152.7522 154.8180 154.9789 337.1974 337.4712 353.9762 358.6497 387.8601 388.1420 539.6793 540.0531 593.0222 593.1123 593.3086 641.4283 669.5907 670.3565 695.7146 696.1025 731.1855 731.2211 758.4289 758.7025 802.7798 803.1952 814.0834 814.2198 818.5570 851.7022 852.7842 881.5100 922.1996 922.5301 924.6668 925.3959 947.4476 958.0281 967.6810 967.9223
redmass: 125.7397 125.7272 126.0341 126.1110 126.1011 126.5145 126.4328 124.2663 123.8911 123.7062 126.6667 126.7746 126.7974 126.7588 126.6604 126.6402 71.9066 72.0002 65.4663 105.2198 105.1015 106.1130 106.0082 110.8419 112.6505 114.0950 114.0151 11.5592 11.5719 13.2319 11.1837 12.6557 12.6366 11.0238 11.0236 11.1383 11.1341 11.0225 11.4562 11.1439 11.1443 11.2432 11.2413 11.0182 11.0180 11.1343 11.1352 11.0123 11.0124 11.2475 11.2476 11.4520 11.1164 11.1169 11.1052 11.1257 11.1287 11.0521 11.0543 11.0919 11.0828 11.1492 11.1481
irintensity: 0.0000 0.0000 0.0000 0.0011 0.0013 0.0000 0.0000 0.0053 0.0010 0.0009 0.0001 0.0001 0.0006 0.0009 0.0002 0.0003 0.1608 0.1626 0.1106 0.0191 0.0202 0.0001 0.0003 0.0005 0.0159 0.0000 0.0000 0.9923 1.0665 3.4137 0.0049 9.9955 9.8778 0.0009 0.0001 0.0321 0.0319 0.0021 22.5840 0.0045 0.0001 1.5561 1.5925 0.0014 0.0005 0.1461 0.1375 0.0014 0.0002 3.0140 3.1419 21.0761 0.0109 0.0060 7.1398 6.1750 5.9093 0.0541 0.0698 80.2860 105.6333 217.3443 218.1181
temp: 298.150 k
press: 1.00000 atm
elementType: 5 5 5 5 5 5 5 5 5 5 5 53 53 53 53 53 53 53 53 53 53 6 53
symmnumber: 1
zpe: 167520.4 jmol-1
zpe.correction: 0.063805 hartree
zpe.thermalcorrener: 0.091937 hartree
zpe.thermalcorrenthalpy: 0.092881 hartree
zpe.thermalcorrgfe: -0.005303 hartree
zpe.sumelectzpe: -3586.029879 hartree
zpe.sumelectthermal: -3586.001747 hartree
zpe.sumelectthermalent: -3586.000803 hartree
zpe.sumelectthermalfe: -3586.098988 hartree
dipole: -0.0019 0.0002 -1.3871
dipole: 1.3871
quadrupole: -394.5723 -394.5716 -390.1167
quadrupole: 0.0007 0.0005 -0.0054
quadrupole: -1.4855 -1.4847 2.9702 0.0007 0.0005 -0.0054
hfenergy: -3586.0936845 hartree
pointgroup: C01 [X(C1B11I11)]
dipole: 0.000767 -0.0004286 -0.5457296 debye
dipolederiv: 0.3695847 -0.3206571 -0.3147899 -0.3224111 -0.032933 0.1743975 -0.3358903 0.1861278 0.0187486 -0.1472398 0.0000896 0.0007718 0.0000915 -0.148253 0.0000919 0.0015599 0.0000421 0.6378028 -0.0766749 -0.290303 0.1532816 -0.2906396 0.4100836 -0.3279266 0.1626607 -0.3473231 0.0180766 0.0126354 -0.2587524 0.206462 -0.2590811 0.444574 -0.4432485 0.1875049 -0.3997982 0.1983121 0.2514254 0.3368409 -0.3576175 0.3356571 0.2061485 -0.3330434 -0.322404 -0.3015552 0.1991092 0.5361252 0.0923817 0.3608392 0.0924598 -0.2013708 0.0444453 0.3801402 0.0468863 0.0170829 0.1955553 0.3776458 -0.263202 0.3795139 0.1410628 -0.2453865 -0.2807797 -0.2619168 0.018676 0.5556204 0.0813822 0.4846673 0.0814722 -0.0971524 0.0595144 0.4362458 0.0535925 0.1994212 -0.0834463 0.1270549 0.0932205 0.1275551 0.5405917 0.4803283 0.0853162 0.4334984 0.198886 0.4072668 -0.2867512 -0.4275939 -0.2858382 0.0508 0.2364138 -0.385799 0.2144026 0.1986377 -0.1846693 0.14182 0.0691219 0.1420445 0.5179044 0.3550225 0.0734457 0.3763045 0.0179615 -0.3880368 0.1786859 0.1536159 0.1791482 -0.1634853 -0.0858212 0.1750661 -0.0975957 -0.1435181 -0.139544 0.1614731 -0.0745925 0.1616337 -0.4104575 0.1595473 -0.0841015 0.180105 -0.1434473 -0.114349 0.1482905 -0.0971255 0.1485127 -0.3623755 0.2085283 -0.0998458 0.2130774 -0.204104 -0.2508352 -0.1925508 0.1675485 -0.1920456 -0.2239536 0.1557536 0.1715046 0.1594549 -0.2038547 -0.48201 -0.051482 -0.1766298 -0.0515977 -0.0707992 -0.0218346 -0.1990957 -0.0245617 -0.1430897 -0.2910474 -0.2104965 0.1283074 -0.2107873 -0.260645 0.1203091 0.1462401 0.1369753 -0.1434676 -0.4247615 -0.0466807 -0.228455 -0.0466288 -0.0506952 -0.0280444 -0.2320095 -0.0285397 -0.2054302 -0.059273 -0.0726791 -0.0437719 -0.073067 -0.4170559 -0.2257943 -0.0454074 -0.2310368 -0.204376 -0.3398697 0.1635919 0.200071 0.1631192 -0.1352674 -0.1103436 0.2048585 -0.1130608 -0.2035803 -0.0794206 -0.0787871 -0.0335594 -0.0790961 -0.4705206 -0.1728628 -0.037855 -0.1950268 -0.1433922 -0.2015257 -0.0001936 0.0002511 -0.0000935 -0.1996638 0.0001066 -0.0004746 0.0000527 -0.4377714 -0.06551 0.0000766 -0.0008207 0.0000782 -0.0665371 -0.0001526 -0.0008803 -0.0001046 -0.5466833 unknown
polarizability: 491.0893334|-0.0047356|491.0553638|-0.0323594|0.0005098|452.7473638 unknown
InChI: InChI=1/CB11I11/c13-2-1-3(2,14)5(1,16)6(1,17)4(1,2,15)8(2,19)7(2,3,18)9(3,5,20)11(5,6,22)10(4,6,8,21)12(7,8,9,11)23
charge -1 multiplicity 2
23 atoms
B  -1.33480496 0.73984013 0.52847051
B  0.0006445 -0.00011771 1.45439655
B  0.64559562 -1.38375074 0.52828878
B  -0.64219983 1.37692086 -0.98705852
B  1.11144094 1.03628662 -0.98739452
B  1.51573887 0.18612369 0.5279241
B  -1.11612282 -1.04124666 0.52862101
B  -1.5081057 -0.18534354 -0.98670231
B  -0.28998718 -1.49199517 -0.98674181
B  1.32926808 -0.73709561 -0.98722622
B  0.2914685 1.49848229 0.52805561
I  -3.03510821 1.68226281 1.43942101
I  1.46676683 -3.14511517 1.43997314
I  -1.41692473 3.03545029 -2.10601222
I  2.4482154 2.28482635 -2.10808011
I  3.4450119 0.42431248 1.43866062
I  -2.53844996 -2.36641309 1.43917458
I  -3.32417115 -0.40794774 -2.10677628
I  -0.64013252 -3.28749655 -2.10706105
I  2.92920776 -1.62406127 -2.10714174
I  0.66109104 3.4066095 1.43979604
C  0.00010735 -0.00033179 -1.68249079
I  0.00126628 0.00005902 3.60589563
