program: Gaussian 16
title: Title
version: AS64L-G16RevC.01
frameworkgroup: C1[X(C4H6B11I11)]
method: UM062X
basis: def2TZVPP
operation: Freq
keyword: #N
keyword: Geom=AllCheck
keyword: Guess=TCheck
keyword: SCRF=Check
keyword: GenChk
keyword: UM062X/def2TZVPP
keyword: Freq
converged: YES YES YES YES
elementType: B
elementType: I
elementType: C
elementType: H
1716.lowfreq: -2.3637 0.0005 0.0006 0.0006 1.0965 2.5028 12.5048 16.8403 37.0340
frequency: 12.5027 16.8210 37.0323 49.2003 49.7155 52.8429 56.3933 59.8211 61.2966 63.2035 65.9715 66.4063 67.9527 68.9973 69.5950 70.2649 79.7321 80.3075 81.3545 83.5746 91.3759 139.5815 146.6027 147.0473 147.4217 148.0641 149.8722 154.6302 155.1659 157.0425 171.7249 258.2121 306.2007 342.8587 349.8836 362.6524 387.0788 393.9633 422.7022 499.0849 565.9786 566.9484 588.0824 601.8246 602.7461 678.7987 680.8908 683.4821 691.4626 694.0496 732.7278 741.0777 747.6809 749.9468 771.4159 790.6376 809.6360 827.5138 828.2891 853.1388 853.5469 861.9948 888.9159 915.4928 921.0963 935.3710 938.4325 940.0427 947.9362 957.2687 958.9450 966.6078 973.8220 1037.3650 1085.5215 1118.3756 1129.8811 1133.5373 1246.5867 1270.9817 1329.5396 1434.5961 1467.1168 1662.6893 3041.2108 3097.0871 3164.7472 3176.5025 3220.5068 3258.6181
redmass: 81.0048 84.8981 46.7976 116.3963 122.9142 37.3855 9.1462 69.4133 54.5874 41.5689 15.6698 32.3247 91.9342 121.2329 25.0581 26.8447 119.3694 110.2864 50.0779 68.2616 39.9068 4.6527 50.6388 101.6898 48.3522 18.1313 101.5561 22.5451 77.6903 4.8884 4.0716 4.3560 3.4979 7.2146 6.9525 11.1737 3.5226 8.6030 3.9167 2.6872 10.9569 10.8626 6.7599 5.7646 11.0103 3.6711 10.8005 4.7108 9.3630 9.3035 3.9593 5.4113 10.5978 10.5792 5.3704 6.6518 8.1182 10.7995 10.9356 10.9852 10.4072 2.4776 8.0226 5.9394 4.5864 10.6529 10.6154 4.2227 3.3846 1.8739 4.0262 3.2122 4.9036 1.1504 3.0120 1.6735 1.3658 1.3548 1.4880 1.3678 1.2976 1.1228 1.1824 3.9618 1.0603 1.0986 1.0562 1.0905 1.0902 1.1171
irintensity: 0.0783 0.2438 0.6740 0.0075 0.0448 0.0509 0.3259 0.0045 0.0109 0.1092 0.0511 0.1680 0.7487 0.0066 0.2385 0.1931 0.0046 0.0235 0.1288 0.0728 0.3611 9.1382 1.4165 0.0430 0.7738 6.6816 0.0593 1.3622 0.2958 7.5335 4.2451 1.1683 1.4173 2.1493 4.4531 0.0026 5.1116 9.5158 6.8786 1.8890 0.0150 0.0538 1.0334 1.4000 0.0039 6.2294 0.1903 4.3885 0.1925 2.4418 0.9323 2.7854 0.0762 0.3224 9.1740 8.5744 1.3681 0.3387 0.0620 0.0578 1.1250 21.6460 72.8698 9.7347 36.7339 2.5075 0.3106 104.3996 24.5025 198.2570 126.9357 10.1013 71.9946 6.2516 20.2002 18.3255 55.5718 50.4704 34.9138 4.8371 29.1404 51.6857 5.0298 460.5499 0.9181 1.9057 11.9351 7.1846 16.5138 1.9112
temp: 298.150 k
press: 1.00000 atm
elementType: 5 5 5 5 5 5 5 5 5 5 5 53 53 53 53 53 53 53 53 53 53 6 1 6 1 6 1 6 1 1 53 1
symmnumber: 1
zpe: 390370.3 jmol-1
zpe.correction: 0.148684 hartree
zpe.thermalcorrener: 0.181184 hartree
zpe.thermalcorrenthalpy: 0.182128 hartree
zpe.thermalcorrgfe: 0.072211 hartree
zpe.sumelectzpe: -3703.897571 hartree
zpe.sumelectthermal: -3703.865072 hartree
zpe.sumelectthermalent: -3703.864127 hartree
zpe.sumelectthermalfe: -3703.974044 hartree
dipole: -2.7430 0.7306 0.2243
dipole: 2.8475
quadrupole: -435.8425 -415.9600 -416.4047
quadrupole: 3.0310 -0.1301 -0.3669
quadrupole: -13.1067 6.7757 6.3310 3.0310 -0.1301 -0.3669
hfenergy: -3704.0462556 hartree
pointgroup: C01 [X(C4H6B11I11)]
dipole: 1.0659621 -0.344488 0.0115531 debye
polarizability: 581.8578347|-18.097808|518.7286124|-3.3162061|2.7408827|505.4871405 unknown
InChI: InChI=1/C4H6B11I10.I/c1-2-3-5-11(21)6(16)4-7(6,11,17)9(4,19)10(4,20)8(4,6,18)12(5,6,11,22)14(5,8,10,24)15(5,9,10,25)13(5,7,9,11)23;/h2,4H,1,3H2;
charge -1 multiplicity 2
32 atoms
B  0.04747976 1.50379508 0.41994152
B  -1.06688685 0.17609319 -0.0582446
B  -0.17506739 -0.8477813 -1.22433279
B  1.44746942 0.79924288 1.24893334
B  1.23687567 -0.96744136 1.28098833
B  -0.29830244 -1.36079342 0.4747406
B  0.04358504 0.91866057 -1.25919432
B  1.57918354 1.30549716 -0.45505293
B  1.44339071 -0.14932952 -1.47604156
B  1.23590736 -1.55362642 -0.40370734
B  -0.17242634 0.09757662 1.48843236
I  -0.66218058 3.46697856 0.94847574
I  -1.1969073 -1.89800987 -2.80152053
I  2.60981445 1.7773956 2.76308074
I  2.1591831 -2.12739376 2.83274979
I  -1.34910872 -3.14261242 1.09342782
I  -0.67177269 2.13176469 -2.88850418
I  2.90844634 2.89530655 -1.01021506
I  2.59885008 -0.32219669 -3.27484228
I  2.15694152 -3.42757633 -0.89768748
I  -1.19250265 0.25596891 3.37875269
C  2.16482305 -0.20502768 0.06999898
H  3.23722205 -0.33467326 0.11314887
C  -2.63782098 0.47907487 -0.17773566
H  -2.82339515 1.38972353 0.40211894
C  -3.56148849 -0.58291408 0.3011555
H  -3.54295128 -0.80252379 1.36408893
C  -4.402009 -1.26860652 -0.48659845
H  -5.01718858 -2.06470246 -0.09031221
H  -4.42178773 -1.10224925 -1.55652101
I  -6.47523247 0.7606801 0.14684719
H  -2.86035446 0.71340082 -1.22154591
