program: Gaussian 16
title: Title
version: AS64L-G16RevC.02
frameworkgroup: C1[X(C9H10I)]
method: UM062X
basis: def2TZVPP
operation: Freq
keyword: #N
keyword: Geom=AllCheck
keyword: Guess=TCheck
keyword: SCRF=Check
keyword: GenChk
keyword: UM062X/def2TZVPP
keyword: Freq
converged: YES YES NO YES
elementType: C
elementType: H
elementType: I
1716.lowfreq: -312.8299 -12.5008 -3.0665 0.0005 0.0006 0.0009 3.0448 19.0385 25.2794
frequency: -312.8299 18.3324 25.0279 33.3398 80.1614 108.5379 136.6643 308.1998 403.4106 407.9212 435.0092 515.8977 567.3465 608.3640 701.3729 734.5341 753.6934 839.6754 857.0374 886.4971 922.9493 955.1378 994.2525 999.3541 1003.1345 1029.9579 1038.6624 1062.2730 1076.5550 1086.7268 1173.8530 1180.6190 1181.9182 1220.7472 1308.1233 1311.6165 1322.1996 1435.3374 1478.5993 1488.2895 1491.9064 1610.9892 1631.9575 1666.2311 3131.6517 3163.9948 3186.4019 3187.2324 3190.2504 3202.6750 3205.0653 3207.5020 3224.6759 3258.9517
redmass: 8.3855 3.1652 4.7542 3.8147 4.7806 4.7750 6.2569 2.4970 2.7699 2.1146 3.3131 2.7645 5.1986 6.3988 2.4717 1.3673 1.5620 1.3421 1.2460 1.5403 1.3199 1.6534 3.4647 1.3914 1.2080 1.3251 4.1687 1.8330 1.2494 1.5360 1.1686 1.1760 1.1369 1.5365 1.3776 2.5057 1.7259 1.2015 2.1391 1.1688 2.1393 4.7848 3.4624 6.8498 1.0569 1.0579 1.0869 1.0947 1.0864 1.0913 1.1064 1.0942 1.0972 1.1160
irintensity: 2.6286 0.0478 0.1685 0.5097 0.5429 0.8898 2.2351 6.1645 0.0699 0.6798 3.5971 21.9482 29.1806 0.1690 17.3442 45.8499 58.9290 2.7902 0.0974 54.6792 0.2340 5.9768 7.4836 0.0973 13.1932 0.0354 0.2237 4.5788 2.5823 6.3983 0.1050 95.6525 5.0883 0.1440 0.3696 0.5845 0.5548 3.4342 6.8090 7.9572 24.0844 25.2988 3.6277 1.6791 2.9644 1.1836 1.5835 1.8991 0.5959 1.1954 1.2528 18.1816 15.5537 1.7274
temp: 298.150 k
press: 1.00000 atm
elementType: 6 6 6 6 6 6 1 1 1 6 1 6 1 6 1 1 53 1 1 1
symmnumber: 1
zpe: 418996.9 jmol-1
zpe.correction: 0.159587 hartree
zpe.thermalcorrener: 0.170058 hartree
zpe.thermalcorrenthalpy: 0.171002 hartree
zpe.thermalcorrgfe: 0.117416 hartree
zpe.sumelectzpe: -646.300460 hartree
zpe.sumelectthermal: -646.289989 hartree
zpe.sumelectthermalent: -646.289045 hartree
zpe.sumelectthermalfe: -646.342631 hartree
dipole: -2.5495 -0.2520 0.0071
dipole: 2.5619
quadrupole: -81.1376 -76.7749 -83.4148
quadrupole: -0.4551 2.4220 -1.6906
quadrupole: -0.6952 3.6676 -2.9723 -0.4551 2.4220 -1.6906
hfenergy: -646.4600472 hartree
pointgroup: C01 [X(C9H10I1)]
dipole: -1.0040965 0.0815986 0.0326852 debye
dipolederiv: -0.410706 0.083645 -0.0179694 -0.1743316 0.0981762 -0.025675 -0.0377404 -0.0132501 -0.1039892 0.0581657 -0.0317937 0.0496902 0.0831584 0.0454633 -0.0347388 0.0240282 -0.0373103 -0.1107497 -0.0012989 0.0570458 0.0364916 0.0451897 -0.1253981 0.0090439 0.0242703 0.0107685 -0.1334432 0.0923086 0.0208668 0.0332981 -0.0647153 0.1214412 -0.0381847 0.0586718 -0.0350994 -0.1097223 -0.4633387 -0.0250733 0.001624 -0.0955632 -0.0469704 -0.0343619 -0.0436958 -0.0175026 -0.0932945 0.793034 -0.0687643 0.0786786 0.1410437 -0.0643833 -0.0047226 0.1669194 -0.0208898 -0.0613629 0.0838791 -0.0635959 -0.0057833 -0.0232289 -0.0441139 0.0205489 -0.0076312 0.0168797 0.1273492 -0.0548547 0.0787148 -0.0426563 0.0554719 -0.0039554 0.0358954 -0.0506933 0.0407666 0.1132748 0.0303115 0.0787087 -0.0454798 0.065396 0.0224513 0.0278521 -0.0465214 0.0293312 0.1064458 -0.2713112 -0.0324359 -0.0282125 0.1140461 -0.0366005 0.0144112 0.0848613 -0.0315956 0.0292434 0.1246638 0.0239542 0.0183593 0.0078889 0.0504744 0.0020503 -0.00228 0.0315039 -0.0393268 -0.2552897 -0.1475051 0.0057481 -0.1033155 -0.066506 -0.0558583 -0.0928054 -0.0025495 0.1027802 0.118052 0.0430182 -0.0054276 0.073151 0.0376539 0.0268566 0.0371572 0.013857 -0.0396475 1.0395509 -0.189167 -0.1389943 -0.196984 0.0988184 0.0422133 -0.3212839 0.1010538 0.0191433 -0.1532414 -0.0234669 0.0331416 -0.0039802 -0.006884 -0.0100425 0.070106 -0.0117423 0.0628749 -0.1129188 0.0330909 -0.04424 0.0191324 0.0433954 0.0346826 0.022345 -0.0093654 0.0066712 -0.6995784 0.2072728 0.1077924 0.089387 -0.1433069 -0.0067034 0.1441416 -0.0526444 -0.139874 0.1586863 0.0288758 0.0145452 0.071307 0.0198146 -0.0307889 0.0319481 -0.0394238 0.0134006 -0.0008268 -0.0395757 -0.0112458 -0.0654709 -0.0616051 0.0228739 -0.019369 0.022248 0.12208 -0.0752876 -0.0338154 -0.0393604 -0.0375825 0.0620349 0.0046479 -0.0424285 0.0049646 0.1281467 unknown
polarizability: 225.8192005|-22.8518826|131.8275507|3.193857|-2.6512644|91.7059847 unknown
InChI: InChI=1/C6H5.C3H5I/c1-2-4-6-5-3-1;1-2-3-4/h1-5H;2H,1,3H2
charge 0 multiplicity 2
20 atoms
C  -2.29990213 2.19940421 -0.09928905
C  -3.62767529 1.85208553 -0.34570842
C  -4.0388983 0.53102652 -0.21620895
C  -3.13558116 -0.45583959 0.15934763
C  -1.80461638 -0.12567516 0.40964083
C  -1.44623833 1.19012903 0.2695273
H  -1.96606639 3.22493056 -0.19762132
H  -4.33766621 2.61469009 -0.6390986
H  -1.0841397 -0.87855789 0.70618316
C  0.84242979 1.71161869 0.62190955
H  0.80750666 2.12004629 -0.38065343
C  1.4617305 0.54472759 0.86403674
H  1.59261709 0.19741794 1.8821384
C  1.9508822 -0.33611966 -0.21242871
H  1.71797723 -1.38441199 -0.0576419
H  1.62848386 -0.01549319 -1.19726936
I  4.12705487 -0.32710143 -0.30291576
H  0.54943134 2.36636954 1.43032374
H  -3.46459009 -1.48234793 0.25825485
H  -5.07017035 0.26916704 -0.4097965
