program: Orca
programVersion: 6.1.0
elementType: O C C C N N C C O C O C C O C H H H H H H H H H H H H
charge: 0
multiplicity: 1
keywords: M062X D3zero def2-TZVP DEF2/J RIJCOSX DEFGRID3 CPCM(Acetonitrile) OPT FREQ TightSCF
frequency: 0.00 0.00 0.00 0.00 0.00 0.00 27.30 72.35 77.16 85.15 129.19 147.62 172.29 176.44 187.94 225.89 234.01 278.18 299.22 325.00 337.30 355.31 420.46 473.87 500.66 556.93 671.75 752.75 765.81 774.87 803.32 819.76 868.92 904.86 911.45 927.94 975.08 978.32 992.46 1046.81 1052.11 1123.52 1154.60 1169.14 1183.41 1184.55 1188.73 1209.04 1216.88 1227.24 1235.75 1243.28 1268.91 1283.98 1319.88 1363.51 1377.12 1460.23 1465.99 1477.45 1481.80 1482.09 1484.51 1486.35 1486.73 1488.89 1707.30 1795.94 1802.31 3089.43 3093.17 3100.28 3114.37 3116.54 3153.83 3173.11 3174.02 3178.97 3187.47 3206.61 3211.90
frequency: 27.30 72.35 77.16 85.15 129.19 147.62 172.29 176.44 187.94 225.89 234.01 278.18 299.22 325.00 337.30 355.31 420.46 473.87 500.66 556.93 671.75 752.75 765.81 774.87 803.32 819.76 868.92 904.86 911.45 927.94 975.08 978.32 992.46 1046.81 1052.11 1123.52 1154.60 1169.14 1183.41 1184.55 1188.73 1209.04 1216.88 1227.24 1235.75 1243.28 1268.91 1283.98 1319.88 1363.51 1377.12 1460.23 1465.99 1477.45 1481.80 1482.09 1484.51 1486.35 1486.73 1488.89 1707.30 1795.94 1802.31 3089.43 3093.17 3100.28 3114.37 3116.54 3153.83 3173.11 3174.02 3178.97 3187.47 3206.61 3211.90
formula: C9H12N2O4
InChI: InChI=1/C9H12N2O4/c1-14-6(12)8-3-4-9(8,7(13)15-2)11-10-5-8/h3-5H2,1-2H3
27 atoms
O  2.721243 0.182943 -0.573292
C  1.698159 -0.23416 -0.093349
C  0.865713 0.482253 0.931546
C  -0.623285 0.687572 0.56393
N  -0.912779 2.076565 1.016404
N  0.089954 2.676286 1.38451
C  1.334747 1.881614 1.272856
C  -1.05839 0.586864 -0.879543
O  -2.302813 0.162587 -0.996451
C  -2.819279 0.07832 -2.334644
O  -0.343222 0.890999 -1.801012
C  -1.070331 -0.360673 1.590804
C  0.378594 -0.387378 2.130457
O  1.158805 -1.408995 -0.410891
C  1.834947 -2.161773 -1.425525
H  1.946057 2.337717 0.492183
H  1.870302 1.952985 2.219206
H  -2.792005 1.060402 -2.802445
H  -3.84057 -0.272357 -2.232929
H  -2.224641 -0.625861 -2.913251
H  -1.850929 -0.033091 2.274303
H  -1.363771 -1.292005 1.111489
H  0.834495 -1.370648 2.202486
H  0.501821 0.143899 3.072449
H  1.263161 -3.076137 -1.54489
H  2.852585 -2.38339 -1.11008
H  1.85143 -1.594539 -2.354948
totalener: -760.53911557972651 hartree
nucrepener: 1100.32758857460703 hartree
electener: -1860.84455526246256 hartree
oneelecener: -3221.87800172478592 hartree
twoeener: 1361.03344646232335 hartree
cpcmener: -0.02212173026301 hartree
kineticenergy: 757.26051583754440 hartree
xcener: -48.906844020232 hartree
dispersion: -0.001422576 hartree
dispersion: -0.001414218 hartree
dispersion: -0.001426715 hartree
dispersion: -0.001419091 hartree
dispersion: -0.001422902 hartree
dispersion: -0.001424046 hartree
dispersion: -0.001428860 hartree
dispersion: -0.001433834 hartree
dispersion: -0.001437577 hartree
dispersion: -0.001437913 hartree
dispersion: -0.001438298 hartree
dispersion: -0.001438970 hartree
dispersion: -0.001440328 hartree
dispersion: -0.001441491 hartree
dispersion: -0.001442832 hartree
elementType: O C N H
energy: -535.8015 -535.5836 -534.3422 -534.1528 -403.3299 -403.2788 -290.9153 -290.7769 -288.5200 -288.1891 -288.1106 -287.7985 -287.7564 -287.1136 -287.0940 -34.2787 -34.0402 -32.3071 -31.6477 -31.4622 -26.8563 -24.5768 -23.0876 -22.9118 -21.9247 -20.7053 -19.1246 -18.6919 -17.9916 -17.6525 -17.3706 -16.0235 -15.9306 -15.8060 -15.7168 -15.4927 -15.2075 -14.9564 -14.0147 -13.8093 -13.6839 -13.2534 -12.9710 -12.5204 -12.1378 -12.0770 -12.0059 -11.6285 -11.5039 -11.0097 -10.7543 -10.6412 -10.5224 -9.9341 -9.7234 -8.7458 -0.3978 0.7588 1.2674 1.7043 2.4562 2.5121 2.6981 2.9562 3.1431 3.4428 3.6271 electronvolt
chargesum: -0.0000000
charge: -0.387255 0.319790 0.049729 0.061677 -0.103452 -0.144735 -0.198191 0.337797 -0.256920 -0.277993 -0.389719 -0.247966 -0.260226 -0.273907 -0.288579 0.184540 0.190630 0.169556 0.169839 0.169223 0.164549 0.174302 0.167109 0.165116 0.168423 0.167766 0.168896
charge: 0.084285 -0.447823 -0.181261 -0.231143 0.073888 0.048433 -0.221209 -0.458679 0.267985 -0.282489 0.097307 -0.172168 -0.156669 0.259170 -0.292527 0.155962 0.153231 0.120301 0.122460 0.119982 0.141394 0.150056 0.142020 0.148275 0.121559 0.118939 0.118721
qa: -0.3873 0.3198 0.0497 0.0617 -0.1035 -0.1447 -0.1982 0.3378 -0.2569 -0.2780 -0.3897 -0.2480 -0.2602 -0.2739 -0.2886 0.1845 0.1906 0.1696 0.1698 0.1692 0.1645 0.1743 0.1671 0.1651 0.1684 0.1678 0.1689
va: 2.0890 4.1813 3.8391 3.8861 2.8095 2.8076 3.8411 4.1718 2.1022 3.8128 2.0810 3.8495 3.8888 2.0417 3.8167 0.9691 0.9518 0.9527 0.9576 0.9512 0.9753 0.9675 0.9690 0.9588 0.9571 0.9541 0.9542
dispersion: -0.001443940 hartree
energy: -760.544313534890 hartree
dipole: -1.613748291 0.902104587 -0.711643704 -8.307328577 6.026491658 -2.280836920 -1.137382414 1.449262694 0.311880281
dipolemethod: SCF
magnitude: 2.409548324 au
magnitude: 6.124585111 debye
temp: 298.15 k
press: 1.00 atm
zeropoint: 0.21528070 hartree
thermalvibcorrection: 0.01152252 hartree
thermalrotcorrection: 0.00141627 hartree
thermaltrasncorrection: 0.00141627 hartree
thermaltotal: -760.31467777 hartree
thermalcorr: 0.01435506 hartree
nonthermalcorr: 0.21528070 hartree
totalcorr: 0.22963576 hartree
thermalcorrenthalpy: 0.00094421 hartree
totalenthalpy: -760.31373357 hartree
vibrat: 0.02046432 hartree
rotat: 0.01500997 hartree
transl: 0.01993682 hartree
total: 0.05541110 hartree
totalentropycorr: -0.05541110 hartree
gibbsenthalpy: -760.36914467 hartree
gibbsminuselec: 0.17516886 hartree
