program: Orca
programVersion: 6.1.0
elementType: O C C C C C O C O C C O C H H H H H H H H H H H H
charge: 0
multiplicity: 1
keywords: M062X D3zero def2-QZVPPD DEF2/J RIJCOSX DEFGRID3 CPCM(Acetonitrile) TightSCF
formula: C9H12O4
InChI: InChI=1/C9H12O4/c1-12-6(10)8-3-4-9(8,5-8)7(11)13-2/h3-5H2,1-2H3
25 atoms
O  -1.925962 0.35746 1.845425
C  -1.477925 0.241142 0.728108
C  -0.840151 -0.99977 0.241668
C  -0.572934 -1.298342 -1.194108
C  0.609093 -1.177095 -0.294551
C  1.655006 -0.141852 -0.430855
O  1.311435 0.857555 -1.23687
C  2.261503 1.921817 -1.359907
O  2.719911 -0.201894 0.139144
C  0.774713 -2.419606 0.568817
C  -0.671925 -2.242738 1.10381
O  -1.510532 1.212373 -0.178706
C  -2.066387 2.458997 0.253965
H  -0.831158 -2.283192 -1.565643
H  -0.723306 -0.47191 -1.872991
H  3.191845 1.545373 -1.781563
H  2.453733 2.365696 -0.384533
H  1.805945 2.646787 -2.026734
H  1.521887 -2.282896 1.345907
H  0.982176 -3.331849 0.010958
H  -1.376553 -3.043719 0.883854
H  -0.693897 -2.011474 2.165378
H  -1.498732 2.848554 1.097359
H  -1.990491 3.126398 -0.598444
H  -3.107295 2.324185 0.542673
elementType: O C H
totalener: -651.10891669566433 hartree
nucrepener: 853.19927958463893 hartree
electener: -1504.29048733329182 hartree
oneelecener: -2580.57388130422669 hartree
twoeener: 1076.28339397093487 hartree
cpcmener: -0.01770628583346 hartree
kineticenergy: 648.59117942318539 hartree
xcener: -42.266949206172 hartree
energy: -535.4808 -535.4804 -533.9937 -533.9926 -290.7862 -290.7857 -288.1737 -288.1731 -288.0192 -288.0100 -287.3988 -287.0292 -287.0202 -33.9748 -33.9014 -31.3185 -31.2901 -28.1255 -23.3522 -23.1526 -22.4032 -21.1644 -19.7908 -18.6406 -17.8665 -17.3231 -17.2128 -15.9908 -15.6849 -15.6576 -15.4753 -14.7663 -14.4265 -14.2367 -13.8704 -13.1736 -13.0355 -12.6930 -12.5915 -11.9125 -11.8130 -11.2913 -11.2057 -10.6212 -10.4736 -10.3107 -10.2901 -9.5691 -8.9861 0.1079 0.1738 0.5028 0.5500 0.6167 1.0404 1.0913 1.1863 1.1933 1.3075 1.5851 electronvolt
chargesum: 0.0000000
charge: -0.613239 0.540072 0.537631 -0.803121 0.485493 0.542695 -0.371398 -0.538589 -0.613289 -0.486088 -0.486869 -0.380531 -0.549196 0.408173 0.154976 0.390036 0.505967 -0.185795 0.292670 0.079627 0.075221 0.297629 0.516746 -0.193906 0.395082
charge: 0.287681 -0.732817 -0.186483 0.288694 -0.186540 -0.732994 0.259415 0.255426 0.287720 0.215528 0.215448 0.259720 0.255460 -0.019447 -0.030798 -0.049371 -0.047215 -0.049441 -0.038976 -0.033061 -0.033042 -0.038884 -0.047204 -0.049446 -0.049375
qa: -0.6132 0.5401 0.5376 -0.8031 0.4855 0.5427 -0.3714 -0.5386 -0.6133 -0.4861 -0.4869 -0.3805 -0.5492 0.4082 0.1550 0.3900 0.5060 -0.1858 0.2927 0.0796 0.0752 0.2976 0.5167 -0.1939 0.3951
va: 1.8747 3.6459 3.7919 3.8741 3.8693 3.6422 1.6024 3.3420 1.8732 2.9096 2.9086 1.6078 3.3461 0.4375 0.9691 0.6403 0.4704 1.4204 0.8225 1.0439 1.0458 0.8106 0.4505 1.4300 0.6316
dispersion: -0.001232350 hartree
energy: -651.110149045686 hartree
dipole: -0.566098918 0.085088627 -0.481010291 1.799097860 -1.315325036 0.483772824 -2.181747763 0.688916235 -1.492831527
dipolemethod: SCF
magnitude: 1.641326602 au
magnitude: 4.171920674 debye
