program: Orca
programVersion: 6.1.0
elementType: C C C C N N C H H H H H H H H
charge: 0
multiplicity: 1
keywords: M062X D3zero def2-TZVP DEF2/J RIJCOSX DEFGRID3 CPCM(Acetonitrile) OPT FREQ TightSCF
frequency: 0.00 0.00 0.00 0.00 0.00 0.00 260.96 408.96 468.13 538.55 716.65 784.22 834.17 841.86 866.44 880.31 907.93 946.72 978.08 992.35 998.70 1029.37 1054.34 1136.22 1139.32 1190.95 1226.81 1245.74 1281.31 1302.88 1309.47 1312.60 1338.45 1476.85 1479.86 1494.03 1661.94 3105.26 3109.43 3113.14 3154.42 3167.62 3177.19 3186.09 3190.44
frequency: 260.96 408.96 468.13 538.55 716.65 784.22 834.17 841.86 866.44 880.31 907.93 946.72 978.08 992.35 998.70 1029.37 1054.34 1136.22 1139.32 1190.95 1226.81 1245.74 1281.31 1302.88 1309.47 1312.60 1338.45 1476.85 1479.86 1494.03 1661.94 3105.26 3109.43 3113.14 3154.42 3167.62 3177.19 3186.09 3190.44
formula: C5H8N2
InChI: InChI=1/C5H8N2/c1-2-5-3-4(1)6-7-5/h4-5H,1-3H2
15 atoms
C  -0.97521 0.625462 -0.307305
C  0.470147 1.181933 -0.247772
C  1.29151 -0.093888 0.051391
C  0.186135 -1.178389 0.115898
N  -0.307839 -1.249397 -1.288554
N  -0.9642 -0.230305 -1.527626
C  -0.961164 -0.433413 0.789959
H  -1.772609 1.359488 -0.341287
H  0.748287 1.662339 -1.184061
H  0.546057 1.914471 0.553746
H  2.025737 -0.322688 -0.718931
H  1.802052 -0.035931 1.010979
H  0.488821 -2.152875 0.482741
H  -0.696018 -0.033519 1.766568
H  -1.881705 -1.01329 0.844254
totalener: -304.78181687276299 hartree
nucrepener: 316.91899599871743 hartree
electener: -621.68822104824721 hartree
oneelecener: -1038.71255602441420 hartree
twoeener: 417.02433497616704 hartree
cpcmener: -0.01260176862399 hartree
kineticenergy: 303.42624890607584 hartree
xcener: -21.199336038934 hartree
dispersion: -0.000145930 hartree
dispersion: -0.000148041 hartree
dispersion: -0.000148435 hartree
dispersion: -0.000148381 hartree
dispersion: -0.000148300 hartree
dispersion: -0.000148281 hartree
elementType: C N H
energy: -402.6979 -402.6742 -287.5909 -287.5902 -286.7867 -286.7774 -286.7593 -31.9278 -25.5480 -23.5534 -22.2134 -19.1187 -18.7098 -16.3942 -16.3024 -15.4703 -14.6666 -12.7870 -12.1395 -11.8545 -11.7630 -11.5928 -10.8891 -10.7414 -10.3105 -8.1872 0.1192 2.0754 3.0339 3.0762 3.2252 3.5294 3.7886 3.8944 4.5612 4.6471 4.7390 electronvolt
chargesum: 0.0000000
charge: 0.009317 -0.320786 -0.319827 0.008555 -0.179752 -0.180020 -0.355136 0.166527 0.164132 0.168202 0.163989 0.168125 0.166614 0.173843 0.166216
charge: -0.275870 -0.222095 -0.222094 -0.275868 0.026921 0.026863 -0.213862 0.143338 0.139782 0.146061 0.139790 0.146041 0.143326 0.153205 0.144462
qa: 0.0093 -0.3208 -0.3198 0.0086 -0.1798 -0.1800 -0.3551 0.1665 0.1641 0.1682 0.1640 0.1681 0.1666 0.1738 0.1662
va: 3.7258 3.8342 3.8336 3.7271 2.8030 2.8031 3.9400 0.9735 0.9619 0.9581 0.9620 0.9582 0.9735 0.9619 0.9636
dispersion: -0.000148283 hartree
energy: -304.783314696423 hartree
dipole: 2.458711413 -2.053161834 0.405549579 2.701070620 -2.034495432 0.666575188 4.765529705 -3.037743427 1.727786278
dipolemethod: SCF
magnitude: 1.895794916 au
magnitude: 4.818727726 debye
temp: 298.15 k
press: 1.00 atm
zeropoint: 0.13055667 hartree
thermalvibcorrection: 0.00210007 hartree
thermalrotcorrection: 0.00141627 hartree
thermaltrasncorrection: 0.00141627 hartree
thermaltotal: -304.64782541 hartree
thermalcorr: 0.00493261 hartree
nonthermalcorr: 0.13055667 hartree
totalcorr: 0.13548929 hartree
thermalcorrenthalpy: 0.00094421 hartree
totalenthalpy: -304.64688120 hartree
vibrat: 0.00293694 hartree
rotat: 0.01249524 hartree
transl: 0.01881539 hartree
total: 0.03424757 hartree
totalentropycorr: -0.03424757 hartree
gibbsenthalpy: -304.68112877 hartree
gibbsminuselec: 0.10218593 hartree
