program: Gaussian 16
title: Title Card Required
version: ES64L-G16RevC.01
method: RM062X
basis: 6-311+G(d,p)
operation: Freq
keyword: #N
keyword: Geom=AllCheck
keyword: Guess=TCheck
keyword: SCRF=Check
keyword: GenChk
keyword: RM062X/6-311+G(d,p)
keyword: Freq
converged: YES YES YES YES
title: Mulliken charges:
elementType: C C C C N H H C O C N C H H C H H C C N C H C H H H S C C C C H C C H Br H H
charge: -0.125344 1.019367 1.434758 -0.624872 -0.094657 0.394947 0.203992 -0.924142 -0.183970 -0.301431 0.000126 -0.229641 0.252926 0.234654 -0.803499 0.252791 0.260681 -0.505309 0.198569 -0.028753 -0.812191 0.316543 -0.180976 0.261552 0.259771 0.395546 0.360377 -0.184294 0.291698 -0.421641 0.363596 0.252154 -0.006915 -0.340833 0.230315 0.156831 0.258531 0.368744
chargesum: 2.00000
title: Mulliken charges with hydrogens summed into heavy atoms:
elementType: C C C C N C O C N C C C C N C C S C C C C C C Br
charge: 0.078648 1.019367 1.434758 -0.624872 0.300290 -0.924142 -0.183970 -0.301431 0.368869 0.257939 -0.290027 -0.505309 0.198569 0.366793 -0.495647 0.340348 0.360377 -0.184294 0.543852 -0.421641 0.363596 0.223400 -0.082302 0.156831
1716.lowfreq: -5.3635 -2.4953 -0.0031 -0.0022 0.0019 5.0584 34.4003 43.3835 53.5760
frequency: 34.3899 43.3819 53.5708 90.3265 117.0009 144.2870 161.4851 168.4055 199.5286 226.0823 241.3296 269.1527 274.9258 311.5153 313.5973 334.5531 352.1449 379.7105 407.6460 417.7954 436.1651 461.3679 472.2084 503.3072 530.3087 546.6599 572.3680 583.6388 597.5394 609.7529 625.0232 635.1641 655.5823 691.5441 693.7038 697.2641 706.8676 716.6827 741.1283 747.1590 749.8602 768.6800 825.1930 844.7213 855.7651 882.7518 897.0318 905.0030 921.0674 938.5319 945.0804 1001.8019 1037.6447 1040.9624 1052.5795 1063.2480 1070.0942 1073.0565 1089.1181 1102.0680 1127.7915 1151.0368 1188.8541 1196.0680 1217.0906 1228.5440 1235.2628 1251.6183 1263.6597 1291.2702 1306.8952 1313.2205 1338.5147 1350.0477 1355.7363 1363.7529 1373.7694 1389.2172 1404.9401 1461.4230 1464.7413 1467.9608 1482.8390 1488.4177 1497.9683 1533.5132 1550.8862 1561.5490 1582.1327 1599.8265 1641.9578 1668.5136 1684.9958 1849.0450 3073.4894 3082.6004 3105.7806 3142.3297 3167.3731 3169.6317 3180.8207 3196.8893 3205.4323 3222.2900 3283.1359 3507.7933 3612.1571 3618.9226
redmass: 7.8808 8.9812 5.6556 5.5890 7.8953 4.1449 8.7936 4.7278 4.5117 3.4725 6.5128 5.5715 6.1449 2.9632 5.4004 7.2759 5.5810 5.9667 5.4538 4.1645 4.2855 5.2144 4.2204 3.3341 4.5892 8.7534 5.9948 4.5950 4.9806 3.4171 5.6994 4.5440 4.5413 2.7464 1.2102 1.9146 2.6131 1.8702 5.7792 2.3478 5.3883 9.1449 3.6778 2.0253 2.5716 1.4311 3.3230 1.7349 2.1723 2.7175 2.6851 3.2771 1.7886 1.7465 2.7175 2.7253 2.5080 2.3954 3.1661 3.9652 1.8280 3.0047 4.5996 1.5022 1.1933 1.2764 1.5511 1.7521 1.4232 1.7118 1.5949 1.8548 2.0721 1.7676 2.4798 1.7881 1.8989 1.6981 1.9516 2.8054 2.8414 2.3969 1.1671 1.1015 1.1686 4.5891 3.9129 5.5740 3.3912 5.7568 5.6540 6.4188 6.6372 12.2684 1.0700 1.0649 1.0601 1.0985 1.1011 1.1106 1.0917 1.0938 1.0917 1.0979 1.1007 1.0789 1.0775 1.0832
irintensity: 1.8612 2.5732 1.0813 2.7375 2.3115 0.1022 3.3483 9.9093 2.8731 4.0819 1.0362 7.7693 1.3888 2.6317 2.9769 13.2547 2.8001 4.5286 3.5417 6.3683 4.8144 2.1521 0.5472 6.0133 4.6160 6.7222 12.3065 4.1535 0.3031 3.5905 22.8739 5.0373 7.8913 20.2310 4.6803 83.5082 50.8957 5.8395 38.8563 6.8621 0.7899 7.1812 8.3427 45.9969 7.2963 5.7672 11.2028 15.6328 8.3552 5.7975 0.4999 26.7361 5.1704 3.2125 18.0002 48.1926 22.2844 3.3907 3.0806 31.5198 45.9745 73.6485 8.1445 39.9007 5.7804 2.4543 0.4861 73.8634 7.0512 16.9850 4.1067 26.4286 55.6434 11.7538 69.6005 94.9148 3.6704 66.6858 108.5273 71.8589 72.3874 164.2516 73.3069 12.7677 32.1584 144.5247 8.7950 69.9480 587.8594 192.9503 59.3644 19.7932 122.2898 386.8191 0.6979 1.3243 1.7084 0.6069 0.5649 1.0909 10.7221 11.3684 15.1001 21.7300 21.8594 281.9839 293.7097 190.4014
temp: 298.150 k
press: 1.00000 atm
elementType: 6 6 6 6 7 1 1 6 8 6 7 6 1 1 6 1 1 6 6 7 6 1 6 1 1 1 16 6 6 6 6 1 6 6 1 35 1 1
symmnumber: 1
zpe: 773267.5 jmol-1
zpe.correction: 0.294522 hartree
zpe.thermalcorrener: 0.312692 hartree
zpe.thermalcorrenthalpy: 0.313636 hartree
zpe.thermalcorrgfe: 0.247792 hartree
zpe.sumelectzpe: -3905.147519 hartree
zpe.sumelectthermal: -3905.129349 hartree
zpe.sumelectthermalent: -3905.128405 hartree
zpe.sumelectthermalfe: -3905.194249 hartree
dipole: 45.9449 20.2696 -2.7860
dipole: 50.2946
quadrupole: 135.8556 -30.6245 -134.9078
quadrupole: 113.2722 -20.6553 -11.0751
quadrupole: 145.7478 -20.7323 -125.0156 113.2722 -20.6553 -11.0751
hfenergy: -3905.4420414 hartree
pointgroup: C01 [X(C18H14Br1N3O1S1)]
dipole: -1.2409379 0.3566292 0.8171874 debye
polarizability: 297.2855412|-24.6363469|307.7296958|-23.1615215|7.560217|169.4982759 unknown
InChI: InChI=1/C18H14BrN3OS/c19-9-1-2-10-18(5-9)6-11(24-10)22-16-13(18)14-12-8(3-4-20-14)7-21-15(12)17(16)23/h1-2,5,7,11,20-22H,3-4,6H2
charge 2 multiplicity 1
38 atoms
C  1.28517944 -0.74848318 0.63174363
C  2.62664403 -0.73413518 0.27714951
C  2.9106299 0.59447599 -0.07241275
C  1.77069113 1.35613679 0.08800489
N  0.79020376 0.51734412 0.50802331
H  -0.16723974 0.79173656 0.69843656
H  0.65470525 -1.55904995 0.96353186
C  1.80394543 2.78037111 -0.07100226
O  0.91859445 3.58238303 0.0636856
C  4.20565301 1.09766554 -0.45475806
N  5.11862064 0.16710783 -0.63291121
C  4.80234312 -1.28865088 -0.70877809
H  4.4572278 -1.47683375 -1.72984695
H  5.73964738 -1.82030118 -0.55673573
C  3.74040806 -1.7340057 0.29919129
H  3.41042209 -2.73663884 0.02508038
H  4.16404057 -1.79244731 1.30623058
C  4.36190057 2.52489963 -0.61531179
C  3.22288055 3.30196199 -0.42349949
N  3.23320077 4.62818223 -0.51953115
C  4.44987388 5.33634992 -0.79609366
H  4.25032525 6.37335905 -1.05363974
C  5.27419824 4.55089804 -1.80915709
H  6.16439572 5.10891374 -2.09901363
H  4.6801225 4.31755338 -2.69434948
H  2.35192035 5.11084263 -0.34031777
S  5.49583711 5.28956066 0.7548217
C  5.67352554 3.28640159 -1.02113357
C  6.67125099 2.42861857 -1.73233941
C  6.17182402 3.81478916 0.29536984
C  7.78234081 2.00639119 -1.10284307
H  6.45679275 2.14960181 -2.75996622
C  7.21186508 3.16873105 1.00645934
C  8.0159432 2.32454921 0.30022672
H  7.4518014 3.44726128 2.0258934
Br 9.04890993 0.91527583 -1.95799377
H  8.89294029 1.89731414 0.77670323
H  6.05407636 0.43267962 -0.91092145
