program: Gaussian 16
title: Title Card Required
version: ES64L-G16RevC.01
method: RM062X
basis: 6-311G(d,p)
operation: Freq
keyword: #N
keyword: Geom=AllCheck
keyword: Guess=TCheck
keyword: SCRF=Check
keyword: GenChk
keyword: RM062X/6-311G(d,p)
keyword: Freq
converged: YES YES YES YES
title: Mulliken charges:
elementType: C C C C N H H C O C N C H H C H H C C N C H C H H H S C C C C H C C H Br H
charge: 0.146153 -0.098492 -0.162585 0.206946 -0.492941 0.293740 0.168728 0.330135 -0.330334 0.279067 -0.393341 -0.150981 0.184392 0.180121 -0.296337 0.189091 0.188582 -0.151670 0.332672 -0.403677 -0.335458 0.238092 -0.128389 0.230865 0.213119 0.314029 0.358258 -0.155028 0.043697 -0.236438 -0.184035 0.174914 0.003310 -0.006828 0.175600 0.094933 0.180092
chargesum: 1.00000
title: Mulliken charges with hydrogens summed into heavy atoms:
elementType: C C C C N C O C N C C C C N C C S C C C C C C Br
charge: 0.314881 -0.098492 -0.162585 0.206946 -0.199202 0.330135 -0.330334 0.279067 -0.393341 0.213532 0.081336 -0.151670 0.332672 -0.089647 -0.097365 0.315594 0.358258 -0.155028 0.218611 -0.236438 -0.184035 0.178909 0.173263 0.094933
1716.lowfreq: -210.3124 -138.6375 -0.0073 -0.0057 -0.0039 9.5066 11.7784 17.9548 37.1884
frequency: -210.1869 -138.6187 37.0558 54.3115 71.7904 115.4829 154.6134 166.0192 176.4399 183.1246 205.2828 232.2257 259.3219 265.6812 295.9442 314.8723 335.6753 371.7590 394.8574 413.4725 417.0875 421.7016 470.0753 471.2687 497.8324 542.0262 546.6005 563.2511 594.6780 611.7449 617.7814 630.7455 638.4678 647.3418 654.6807 682.9157 706.5241 710.8664 741.2450 761.0437 782.3709 798.9332 808.8886 815.5922 838.8974 872.7901 877.4283 886.7230 920.4717 934.7476 993.8297 1012.4770 1014.0727 1029.4705 1043.7572 1053.8566 1064.0420 1076.7189 1115.9947 1120.3024 1151.8121 1172.1809 1202.5915 1204.5753 1221.1474 1244.5741 1256.6050 1262.8152 1280.0044 1310.6987 1312.4150 1314.4468 1350.5136 1357.8008 1382.8541 1385.6362 1419.1553 1423.1539 1449.6551 1470.5984 1473.6112 1480.1772 1505.0156 1515.1886 1538.7719 1601.1805 1615.9015 1634.3488 1645.9263 1692.5058 1753.1203 1828.9326 3080.9194 3090.2360 3093.3816 3105.7653 3129.5456 3151.1334 3188.6142 3225.6870 3233.6980 3240.4993 3280.8900 3513.6633 3664.4316
redmass: 7.3064 1.7311 12.6337 6.3285 7.3204 6.9002 4.9257 7.3504 6.6393 6.7280 8.1250 7.3130 5.9774 4.4711 4.3065 5.7799 7.9129 4.4709 3.6439 5.3568 3.2245 6.3107 7.1680 6.6536 5.8508 5.7736 6.5507 6.9158 2.3410 3.2778 8.7204 5.7580 4.4266 2.1071 4.2438 4.3306 2.4837 1.8005 6.5696 6.4500 7.9340 1.3790 2.3001 2.8904 4.0521 1.4740 1.3971 4.4507 3.9257 2.7766 2.8335 1.3592 2.6170 5.0852 1.9911 4.4752 2.5364 2.5520 1.7287 3.2384 2.5621 4.2725 1.3302 1.3638 1.3992 1.4625 1.1170 1.7212 3.0152 2.6216 1.0714 1.8060 1.6265 1.7281 1.4336 2.7281 2.9788 3.0506 2.5086 1.1644 1.0909 4.2207 1.1865 2.8802 4.7200 7.5848 6.6574 6.4557 7.4422 6.5420 10.4569 11.8903 1.0613 1.0608 1.0596 1.1045 1.1045 1.1079 1.0907 1.0884 1.0937 1.0995 1.0990 1.0780 1.0824
irintensity: 27.8462 0.6984 0.8077 0.8754 3.3273 0.0499 1.1850 1.6749 4.4049 7.9036 16.9310 5.3448 10.4557 21.1767 1.3942 18.6916 35.0890 2.6480 31.8630 3.1210 21.6814 8.9482 4.6653 7.7687 20.4733 27.1496 12.5968 7.8527 62.4808 13.4990 18.2811 2.2946 20.7906 18.2353 34.6280 15.8308 22.7479 46.2134 0.3213 7.2072 0.9692 0.6113 36.3749 27.2586 4.9049 11.4294 8.7525 6.2793 5.6036 13.4891 6.8395 7.5598 48.1361 24.8242 0.4458 40.9115 53.8623 3.1904 92.0895 23.2391 20.1074 26.7972 1.8669 11.5770 15.4315 8.7924 0.6123 23.2285 6.0250 109.1298 3.1355 9.3980 71.1645 2.5299 2.4207 5.9300 19.4715 18.8705 56.9432 35.7186 5.3452 144.8550 47.9671 68.5334 3.0569 43.8875 277.9489 219.7441 24.6756 25.9954 10.3170 504.4652 5.0533 11.6579 0.5783 0.3072 5.0201 1.7976 0.7523 3.8384 3.5385 2.9936 5.6241 285.6978 222.5442
temp: 298.150 k
press: 1.00000 atm
elementType: 6 6 6 6 7 1 1 6 8 6 7 6 1 1 6 1 1 6 6 7 6 1 6 1 1 1 16 6 6 6 6 1 6 6 1 35 1
symmnumber: 1
zpe: 732674.1 jmol-1
zpe.correction: 0.279061 hartree
zpe.thermalcorrener: 0.296313 hartree
zpe.thermalcorrenthalpy: 0.297257 hartree
zpe.thermalcorrgfe: 0.233838 hartree
zpe.sumelectzpe: -3904.864430 hartree
zpe.sumelectthermal: -3904.847177 hartree
zpe.sumelectthermalent: -3904.846233 hartree
zpe.sumelectthermalfe: -3904.909653 hartree
dipole: 20.2621 11.1181 -1.8530
dipole: 23.1862
quadrupole: -35.6886 -82.0761 -143.4945
quadrupole: 58.0570 -11.9064 -15.0540
quadrupole: 51.3978 5.0103 -56.4081 58.0570 -11.9064 -15.0540
hfenergy: -3905.1434904 hartree
pointgroup: C01 [X(C18H13Br1N3O1S1)]
dipole: -1.595684 0.6699716 0.2501517 debye
polarizability: 282.6358841|-27.2845329|288.5757982|-25.9082701|3.0686258|162.697571 unknown
InChI: InChI=1/C18H13BrN3OS/c19-9-1-3-17-16(5-9)6-10(24-17)22-15-13(23)12-11-8(7-21-12)2-4-20-14(11)18(15,16)17/h1,3,5,7,10,21-22H,2,4,6H2
charge 1 multiplicity 1
37 atoms
C  1.25296444 -0.63702293 0.55302314
C  2.62393918 -0.63522608 0.32703999
C  2.97310738 0.69841413 0.13029971
C  1.84011158 1.4826996 0.2306008
N  0.79276683 0.64412013 0.49300078
H  -0.16582249 0.93614361 0.61838164
H  0.57753683 -1.45494377 0.74997662
C  1.87809923 2.89389069 0.05153124
O  0.98029856 3.70286098 0.10449598
C  4.33213396 1.14717935 -0.13879814
N  5.29811018 0.32827981 -0.21705386
C  5.08879335 -1.11092557 -0.03203545
H  5.50615853 -1.57149989 -0.93029858
H  5.77026436 -1.38928959 0.7751661
C  3.66972618 -1.70589792 0.25371761
H  3.4141072 -2.41961119 -0.53144807
H  3.69730749 -2.26704802 1.18932417
C  4.4603831 2.61758938 -0.30740657
C  3.30037968 3.40570085 -0.26628375
N  3.31191229 4.70661268 -0.47084297
C  4.5521915 5.38193293 -0.73227103
H  4.38372484 6.44040832 -0.90525943
C  5.27402734 4.65938402 -1.87542323
H  6.14334223 5.24778836 -2.17726998
H  4.61620382 4.51588613 -2.73440792
H  2.42780516 5.19390928 -0.32574634
S  5.62345933 5.14170039 0.74928425
C  5.77680779 3.37108151 -1.2765689
C  6.62029795 2.44644338 -2.01504122
C  5.9575987 3.49860918 0.16272748
C  7.56617695 1.76301547 -1.34361058
H  6.4955936 2.35076101 -3.08579574
C  6.97160826 2.69354944 0.8301356
C  7.75366869 1.88899222 0.09141742
H  7.11160081 2.79947428 1.89824796
Br 8.68922072 0.55733278 -2.24478339
H  8.54264846 1.31174406 0.55645466
