program: Gaussian 16
title: Title Card Required
version: ES64L-G16RevC.01
method: RM062X
basis: 6-311+G(d,p)
operation: Freq
keyword: #N
keyword: Geom=AllCheck
keyword: Guess=TCheck
keyword: SCRF=Check
keyword: GenChk
keyword: RM062X/6-311+G(d,p)
keyword: Freq
converged: YES YES YES YES
title: Mulliken charges:
elementType: C C C C N H H C O C N C H H C H H C C N C H C H H H S C C C C H C C H Br H
charge: -0.304992 0.864366 1.090064 -0.468943 -0.131436 0.362382 0.174548 -0.974554 -0.250619 -0.292349 0.198939 -0.245767 0.200209 0.215187 -0.812444 0.232765 0.217646 0.099895 -0.224513 0.013900 -1.027319 0.276657 -0.077177 0.236575 0.259927 0.349909 0.240760 -1.193787 -0.008683 0.547579 0.694084 0.210096 0.417940 -0.374430 0.241701 0.037744 0.204142
chargesum: 1.00000
title: Mulliken charges with hydrogens summed into heavy atoms:
elementType: C C C C N C O C N C C C C N C C S C C C C C C Br
charge: -0.130444 0.864366 1.090064 -0.468943 0.230946 -0.974554 -0.250619 -0.292349 0.198939 0.169629 -0.362034 0.099895 -0.224513 0.363809 -0.750663 0.419325 0.240760 -1.193787 0.201413 0.547579 0.694084 0.659641 -0.170288 0.037744
1716.lowfreq: -6.4307 -3.3098 -0.0069 -0.0027 0.0055 1.4645 23.4231 49.2736 64.3507
frequency: 23.4114 49.2675 64.3478 102.0647 109.8432 141.2291 147.1876 162.1560 187.6052 202.7195 216.6658 238.3098 254.7001 296.0318 326.6286 357.5294 367.5581 390.7271 398.5418 416.6106 430.5108 457.3483 464.8710 496.8368 521.1677 532.8933 547.7789 570.3612 582.3019 593.2455 598.4359 611.8367 625.5939 641.5166 664.9409 668.8823 723.8514 736.1296 742.0797 765.6811 776.6194 820.6541 822.1549 847.5808 855.6429 874.3184 897.6353 905.0521 934.6681 939.0209 989.7680 1000.6110 1018.1105 1044.1370 1058.1818 1080.1930 1082.1495 1094.2274 1113.6417 1125.3767 1146.2089 1181.2654 1199.4119 1205.5079 1218.0363 1230.5632 1252.7929 1258.1523 1292.4763 1308.9999 1325.1545 1351.2005 1355.3836 1361.4960 1373.6651 1379.2529 1422.1036 1426.9605 1460.0121 1465.8114 1480.4235 1486.1948 1497.5162 1527.8228 1534.0750 1542.7319 1603.6678 1637.0473 1659.4343 1661.6847 1733.4794 1813.6441 3047.4779 3069.3386 3083.1572 3129.6068 3136.6638 3142.6195 3179.4877 3227.3232 3241.2736 3253.1058 3286.7189 3596.6936 3663.3864
redmass: 10.0044 6.7422 5.7020 8.0234 7.1369 4.9153 4.1015 4.2835 6.1470 6.3976 7.1949 3.5849 5.0175 3.3183 7.5672 5.7717 4.7932 5.7644 7.1950 7.1852 5.3763 5.7773 5.7164 1.6188 4.0596 3.1280 4.6789 3.7540 3.8458 5.0475 3.1802 3.7470 3.3876 1.9564 4.6875 5.8661 5.2543 6.8538 3.2540 10.4559 4.8664 2.7091 2.8180 1.8022 1.4850 2.2545 2.2272 4.0757 2.6950 2.8767 2.6144 1.4315 3.2673 2.7435 2.4679 2.5099 2.6226 3.1328 1.7617 2.5767 2.4057 1.3752 2.9313 1.5914 1.3859 1.5991 1.3506 1.4169 1.6233 2.0703 1.9281 1.7721 1.7255 2.0407 1.5917 2.4824 3.4189 2.1572 1.3952 2.1266 1.3055 1.5673 1.7925 4.8082 5.2803 2.2431 7.9383 7.7968 6.9827 8.9338 10.2008 12.5167 1.0716 1.0655 1.0628 1.0960 1.0965 1.1024 1.0900 1.0940 1.0902 1.0979 1.0988 1.0781 1.0822
irintensity: 0.1855 1.1409 3.6458 1.3123 24.7452 3.9445 1.4482 3.4087 6.8979 1.0350 0.6759 1.3280 5.5572 3.9634 14.9043 7.0697 0.4721 14.1927 20.7529 0.7495 11.0305 3.1855 22.2391 65.0587 2.8931 21.6670 4.4157 2.1168 49.1433 3.0995 23.0055 24.6746 19.1883 17.0393 22.8035 9.3367 7.5708 7.6334 5.3644 0.5616 8.6457 35.5577 9.2587 9.5390 10.6868 8.5979 8.4416 25.2354 13.6979 15.2918 3.1055 62.9095 38.0985 36.1647 3.9062 16.9852 24.2477 62.2027 96.5048 36.5447 29.7298 70.2690 2.5309 32.2908 18.6309 32.1716 40.0513 16.7175 6.0098 33.9941 3.6180 29.4917 13.7080 57.4807 6.2788 6.1067 52.9778 78.8443 154.2113 143.8133 4.4191 56.5553 69.2883 1.6200 15.1695 207.7104 65.6317 107.6775 580.8845 13.0935 65.4701 513.0183 9.4424 10.1231 1.3867 8.8972 9.2512 0.3708 0.2456 5.5819 2.1025 10.9427 4.2115 194.4445 219.1910
temp: 298.150 k
press: 1.00000 atm
elementType: 6 6 6 6 7 1 1 6 8 6 7 6 1 1 6 1 1 6 6 7 6 1 6 1 1 1 16 6 6 6 6 1 6 6 1 35 1
symmnumber: 1
zpe: 736649.5 jmol-1
zpe.correction: 0.280575 hartree
zpe.thermalcorrener: 0.298960 hartree
zpe.thermalcorrenthalpy: 0.299904 hartree
zpe.thermalcorrgfe: 0.233402 hartree
zpe.sumelectzpe: -3904.877443 hartree
zpe.sumelectthermal: -3904.859058 hartree
zpe.sumelectthermalent: -3904.858114 hartree
zpe.sumelectthermalfe: -3904.924615 hartree
dipole: -0.8733 -0.2019 -0.4134
dipole: 0.9871
quadrupole: -108.0316 -116.3567 -140.0207
quadrupole: 10.7811 -15.1258 -14.2032
quadrupole: 13.4381 5.1129 -18.5510 10.7811 -15.1258 -14.2032
hfenergy: -3905.1580177 hartree
pointgroup: C01 [X(C18H13Br1N3O1S1)]
dipole: -0.1271171 -0.0900862 -0.2790647 debye
polarizability: 333.4455868|-20.5712656|296.3890677|-59.8899944|-14.8951267|199.0740376 unknown
InChI: InChI=1/C18H13BrN3OS/c19-10-1-3-18-9(5-10)6-11(24-18)22-16-13(18)14-12-8(2-4-20-14)7-21-15(12)17(16)23/h1,3,5,7,11,21-22H,2,4,6H2
charge 1 multiplicity 1
37 atoms
C  -4.33800965 -2.50198133 1.49898824
C  -2.96965713 -2.60218981 1.30004465
C  -2.52744397 -1.29025697 1.12179844
C  -3.58620985 -0.41945706 1.19572215
N  -4.69536513 -1.17914649 1.43796695
H  -5.63162797 -0.81834195 1.55467285
H  -5.08429047 -3.26094834 1.67317038
C  -3.41165774 0.99085349 0.95101446
O  -4.25299734 1.85912845 0.99148343
C  -1.15262918 -0.92193167 0.88210197
N  -0.20766628 -1.77518112 0.97909446
C  -0.53985587 -3.12868246 1.46045624
H  0.22258608 -3.80862838 1.08131152
H  -0.4192461 -3.09187153 2.55002502
C  -1.94560944 -3.68573189 1.12333844
H  -1.96649409 -4.03117863 0.08505403
H  -2.13144436 -4.55434598 1.75652913
C  -0.92054725 0.48913026 0.58158772
C  -1.97193906 1.36243253 0.57354187
N  -1.83838365 2.667741 0.2436432
C  -0.56399305 3.16531177 -0.1664195
H  -0.58802463 4.25004078 -0.21956944
C  -0.09174903 2.50262129 -1.47873884
H  0.50597247 3.20192707 -2.06457846
H  -0.94521523 2.18742688 -2.08599032
H  -2.597216 3.28756601 0.50470244
S  0.75984223 2.66490346 1.06765938
C  0.76202782 1.33259448 -1.06562915
C  1.76636199 0.78335597 -1.79996652
C  0.5150205 0.94152126 0.34418563
C  2.6708805 -0.0912934 -1.1536417
H  1.94669579 1.08053859 -2.82552753
C  1.52596934 0.03849631 0.93807759
C  2.59561782 -0.40793032 0.21069755
H  1.45076343 -0.1724303 1.99642435
Br 4.08614872 -0.77004049 -2.143599
H  3.35476578 -1.03170749 0.66194736
