program: Gaussian 16
title: Title Card Required
version: ES64L-G16RevC.01
method: RM062X
basis: 6-311G(d,p)
operation: Freq
keyword: #N
keyword: Geom=AllCheck
keyword: Guess=TCheck
keyword: SCRF=Check
keyword: GenChk
keyword: RM062X/6-311G(d,p)
keyword: Freq
converged: YES YES NO YES
title: Mulliken charges:
elementType: C C C C N H H C O C N C H H C H H C C N C H C H H H S C C C C H C C H Br H H
charge: 0.182606 -0.054464 -0.263909 0.234910 -0.472736 0.321982 0.200256 0.357960 -0.269324 0.533834 -0.523222 -0.076445 0.220705 0.219279 -0.312953 0.224270 0.225530 -0.193061 0.345134 -0.366458 -0.334389 0.267439 -0.122301 0.249812 0.235115 0.339800 0.462056 -0.206726 -0.022664 -0.167273 -0.307546 0.208994 -0.030984 -0.026590 0.203212 0.188032 0.214475 0.315643
chargesum: 2.00000
title: Mulliken charges with hydrogens summed into heavy atoms:
elementType: C C C C N C O C N C C C C N C C S C C C C C C Br
charge: 0.382861 -0.054464 -0.263909 0.234910 -0.150754 0.357960 -0.269324 0.533834 -0.207579 0.363539 0.136847 -0.193061 0.345134 -0.026658 -0.066950 0.362626 0.462056 -0.206726 0.186330 -0.167273 -0.307546 0.172228 0.187885 0.188032
1716.lowfreq: -173.9139 -146.1996 -6.1999 -5.2832 -0.0053 0.0023 0.0040 3.7905 44.1379
frequency: -173.9138 -146.1990 44.1293 48.5292 61.9238 110.4587 139.8303 170.6628 179.2431 207.8719 214.5895 247.4171 266.8296 283.1681 293.5281 321.6442 349.4822 371.0312 399.2938 413.3527 421.7487 445.5087 471.9419 492.9202 516.9613 552.8991 572.6054 597.1247 608.9145 618.1267 626.7173 637.7205 657.2787 679.3715 697.3469 709.3285 737.6979 744.7750 763.9873 775.9819 792.1734 828.1000 830.4977 836.3872 841.7413 872.2281 885.1560 895.1030 899.9512 902.6858 935.3152 1000.2302 1013.2640 1024.2198 1035.9698 1053.6006 1055.6929 1063.9806 1080.7731 1115.2018 1120.0483 1151.7901 1177.3140 1198.9861 1208.3227 1236.0430 1237.9801 1261.0317 1273.8551 1280.0724 1313.2965 1318.9565 1326.1897 1340.2089 1353.1896 1362.9398 1395.2744 1405.4541 1419.3278 1435.7892 1463.2306 1476.2466 1479.9070 1489.0573 1499.5395 1512.2653 1554.2424 1605.2350 1617.9943 1646.1356 1674.4529 1683.4895 1729.0242 1863.4208 3097.7313 3099.5726 3103.5774 3133.4212 3152.3340 3159.6364 3187.5694 3216.5786 3217.1533 3230.2824 3282.7214 3441.8372 3570.9151 3610.5145
redmass: 3.1081 2.6882 10.3115 6.7101 6.7354 6.1479 5.1825 7.5415 6.7247 6.0730 4.9952 7.2305 4.3531 5.7900 4.0040 6.8880 6.2682 4.2826 5.4680 4.0095 5.5066 3.7442 7.1727 5.5445 6.3878 5.8331 6.9119 5.4852 3.5888 6.1560 6.1228 4.8503 4.9920 5.1794 4.9813 1.2886 3.1038 5.0673 1.6552 4.7648 3.2209 1.4715 1.7602 2.8181 1.6772 2.3363 3.4121 1.5231 2.0777 3.8768 2.7729 3.6763 2.2257 1.5261 2.9086 1.8939 2.7761 3.7932 2.7123 2.9585 2.2687 2.6728 3.3172 1.7423 1.3070 1.5283 1.4414 2.0935 1.8113 1.1123 1.6928 1.0692 2.6803 1.8175 1.7003 2.1055 1.5075 2.6256 2.1583 2.1902 2.7930 2.5159 1.1331 1.1546 2.2124 1.1194 5.6883 6.4294 7.1497 5.2458 6.3497 6.3536 5.8696 12.1451 1.0605 1.0601 1.0610 1.1067 1.1069 1.1097 1.0919 1.0937 1.0894 1.0999 1.1009 1.0789 1.0775 1.0836
irintensity: 94.7729 69.7116 2.3421 3.6884 1.8099 0.3086 1.6254 2.8765 5.2907 11.7608 0.1501 20.1470 8.8927 1.3687 0.4795 14.6183 4.6260 4.1007 24.8091 1.0673 6.9109 4.0163 0.3597 4.2930 4.2394 2.9118 3.5432 16.4287 14.5704 0.8190 5.2346 13.0870 7.1600 19.2097 18.1524 85.1997 14.1875 3.1668 38.4515 10.8904 6.7402 55.6783 28.1955 10.6550 59.0950 2.1403 3.0497 9.1199 15.2675 1.2334 15.5747 16.7312 6.7530 1.1778 38.7781 3.2423 49.9353 21.6736 10.4936 47.0611 61.4012 41.4724 11.7225 32.8481 12.4927 5.8127 11.6854 2.0738 28.1159 0.7262 0.7800 5.3903 101.2117 19.6763 113.3669 14.3658 16.2851 25.9691 36.9888 44.9804 83.0905 77.8166 8.9529 33.6925 109.7572 17.1802 50.8281 231.8359 12.6948 123.8576 333.2504 19.3557 93.0771 355.0897 0.2455 3.2732 2.0919 0.1245 0.7610 4.0941 13.0704 12.9352 9.6452 15.3557 26.3752 289.0170 307.6705 293.7776
temp: 298.150 k
press: 1.00000 atm
elementType: 6 6 6 6 7 1 1 6 8 6 7 6 1 1 6 1 1 6 6 7 6 1 6 1 1 1 16 6 6 6 6 1 6 6 1 35 1 1
symmnumber: 1
zpe: 771761.0 jmol-1
zpe.correction: 0.293948 hartree
zpe.thermalcorrener: 0.310929 hartree
zpe.thermalcorrenthalpy: 0.311873 hartree
zpe.thermalcorrgfe: 0.248863 hartree
zpe.sumelectzpe: -3905.124355 hartree
zpe.sumelectthermal: -3905.107375 hartree
zpe.sumelectthermalent: -3905.106431 hartree
zpe.sumelectthermalfe: -3905.169441 hartree
dipole: -7.3534 -0.5406 2.8016
dipole: 7.8876
quadrupole: -84.0196 -75.6694 -133.8632
quadrupole: 10.3664 -15.1473 -12.4411
quadrupole: 13.8311 22.1814 -36.0125 10.3664 -15.1473 -12.4411
hfenergy: -3905.4183037 hartree
pointgroup: C01 [X(C18H14Br1N3O1S1)]
dipole: -2.591008 -0.3305131 0.7566143 debye
polarizability: 285.3407197|-16.8323335|282.601679|-33.3803888|-0.3059895|161.4838793 unknown
InChI: InChI=1/C18H14BrN3OS/c19-9-1-3-17-16(5-9)6-10(24-17)22-15-13(23)12-11-8(7-21-12)2-4-20-14(11)18(15,16)17/h1,3,5,7,10,20-22H,2,4,6H2
charge 2 multiplicity 1
38 atoms
C  -3.89652706 -2.55217205 1.42478171
C  -2.55864057 -2.57602113 1.05566375
C  -2.21314505 -1.24429868 0.80527508
C  -3.32796064 -0.44410111 1.00346962
N  -4.33677576 -1.26197258 1.38535159
H  -5.28004941 -0.95747573 1.60153514
H  -4.56065863 -3.3550193 1.70645255
C  -3.30415843 0.96342802 0.75009532
O  -4.1775562 1.78025604 0.85587175
C  -0.9339584 -0.80077744 0.33494489
N  -0.0486051 -1.72941622 0.12899863
C  -0.19374547 -3.19114596 0.38829296
H  0.08129477 -3.67731064 -0.54796607
H  0.58092413 -3.42734239 1.11898872
C  -1.57789459 -3.69231147 0.87992347
H  -1.96913167 -4.41416842 0.16190822
H  -1.44249042 -4.22461766 1.82221754
C  -0.72600284 0.64095041 0.11956458
C  -1.91007316 1.44321453 0.26983051
N  -1.87097333 2.72798746 0.09222483
C  -0.61003034 3.38684782 -0.20160893
H  -0.76412445 4.44547068 -0.3904089
C  0.08771575 2.61446253 -1.3183571
H  0.99886327 3.14022452 -1.60850588
H  -0.56022897 2.50134231 -2.18954454
H  -2.73354803 3.24743115 0.28839787
S  0.39887123 3.12648033 1.31207217
C  0.48109701 1.29131488 -0.67734485
C  1.45430793 0.44120897 -1.41001716
C  0.71198761 1.4841683 0.75634653
C  2.48492653 -0.11104132 -0.74205131
H  1.36721608 0.36474532 -2.48788217
C  1.72102374 0.68917467 1.45042599
C  2.59674468 -0.02183316 0.71790663
H  1.8252819 0.78409499 2.524721
Br 3.80480065 -1.09940659 -1.63356293
H  3.42340325 -0.53290594 1.19794085
H  0.84111398 -1.46648314 -0.28009708
