program: Gaussian 16
title: Title Card Required
version: ES64L-G16RevC.01
method: RM062X
basis: 6-311+G(d,p)
operation: Freq
keyword: #N
keyword: Geom=AllCheck
keyword: Guess=TCheck
keyword: SCRF=Check
keyword: GenChk
keyword: RM062X/6-311+G(d,p)
keyword: Freq
converged: YES YES YES YES
title: Mulliken charges:
elementType: C C C C N H H C O C N C H H C H H C C N C H C H S C C C C H C C H Br H H H
charge: -0.148500 0.893637 1.626311 -0.565865 -0.102243 0.372738 0.182298 -1.106161 -0.213671 -0.697866 0.065127 -0.220277 0.215337 0.228239 -0.814270 0.245340 0.229476 -0.197174 0.121311 0.042440 -1.142617 0.269593 -0.096225 0.374801 0.293671 -0.711416 -0.206295 0.826282 0.597867 0.198128 -0.059468 -0.434211 0.225186 -0.034109 0.213077 0.340884 0.188622
chargesum: 1.00000
title: Mulliken charges with hydrogens summed into heavy atoms:
elementType: C C C C N C O C N C C C C N C C S C C C C C C Br
charge: 0.033798 0.893637 1.626311 -0.565865 0.270495 -1.106161 -0.213671 -0.697866 0.406012 0.223299 -0.339454 -0.197174 0.121311 0.417242 -0.873024 0.092397 0.293671 -0.711416 -0.008168 0.826282 0.597867 0.165718 -0.221134 -0.034109
1716.lowfreq: -4.7571 -3.7359 -1.9832 -0.0102 -0.0101 -0.0065 27.1960 35.2680 68.9879
frequency: 27.1636 35.2636 68.9816 104.6802 143.5278 169.3414 173.2219 179.3846 197.6877 215.2289 223.4670 236.2508 285.1239 309.7819 329.7250 351.8764 362.3387 389.3592 405.5769 423.0485 439.9143 459.1636 488.4794 521.1939 547.0212 555.5339 577.2741 588.6786 602.0089 605.4996 631.0596 633.8377 653.5304 663.3737 666.6702 678.8905 717.5299 727.5782 743.1425 768.6649 774.7314 779.1266 808.6410 829.7969 846.6613 859.1064 870.3536 902.9901 908.7047 932.8607 953.3364 978.6267 995.5015 1021.8732 1025.2226 1044.3125 1055.3668 1068.9149 1080.7824 1108.2326 1139.1113 1163.9965 1198.6675 1205.1324 1226.0316 1229.7811 1235.0252 1263.8952 1300.3865 1309.1086 1316.4280 1323.4930 1337.4258 1366.2007 1386.8853 1391.1839 1409.9560 1422.5529 1461.9249 1476.7806 1485.3517 1501.5723 1527.0403 1543.6905 1585.3424 1600.8198 1640.5395 1656.9384 1679.6469 1689.0630 1719.4850 1833.1924 3067.3746 3077.5134 3138.0133 3160.8872 3180.2239 3189.4920 3219.3550 3225.5754 3240.0535 3286.5525 3537.7975 3571.7454 3648.7796
redmass: 11.4845 6.6234 6.1161 8.3712 3.9122 7.1400 4.7727 5.0921 5.7849 8.6229 3.2661 7.3761 6.5232 2.9025 6.4506 4.9043 5.4753 5.8967 6.7041 5.4922 4.8226 4.1550 7.4217 4.8352 4.5218 7.8131 4.9252 4.3053 4.4101 3.7840 3.8529 3.6847 1.9691 1.8813 2.2425 1.7116 1.7829 4.1107 4.9560 2.6906 5.2654 6.2378 2.0820 1.6130 4.5803 1.5233 2.7664 2.9449 1.8380 3.0301 3.1856 3.6419 2.6950 1.4628 3.1357 2.6537 3.9611 1.9693 3.0970 1.8782 2.3255 2.9392 1.4406 3.2952 1.3615 1.3873 1.4909 1.3932 1.8041 1.6273 1.6526 1.4619 3.8279 1.5404 1.5455 3.4693 2.1303 1.8219 2.8843 2.5403 1.2327 1.3231 2.8930 4.2483 2.9054 5.7679 9.0728 5.7345 7.4877 7.0284 7.5267 12.3785 1.0706 1.0647 1.0983 1.0993 1.0898 1.0893 1.0965 1.0939 1.0962 1.0995 1.0775 1.0781 1.0825
irintensity: 0.9273 1.4635 0.8806 0.0824 0.2068 2.3922 6.7220 2.1607 1.4055 0.8305 3.8854 1.7856 0.9192 5.8113 8.4524 0.7529 7.8193 10.8230 0.7922 3.7058 2.6894 4.2161 1.5346 0.3701 3.3268 16.6781 11.3902 9.7449 8.6897 10.6833 12.2187 2.8168 0.5135 57.9424 37.6102 34.1409 10.1383 3.4387 19.3375 19.3585 6.6788 1.2143 9.5532 41.4758 12.5349 8.5527 10.2799 7.0843 25.4665 4.3684 0.4351 15.3201 16.1065 5.2045 12.3864 47.6953 38.9710 0.3631 25.5661 88.6276 6.2114 40.4677 6.1052 16.0514 3.2033 22.5971 23.7485 19.6350 12.1523 16.6646 31.6572 15.2532 10.5661 13.8737 76.8816 87.3882 246.7540 17.1769 41.2018 28.3845 51.5155 93.5943 127.3394 7.5725 737.5730 76.8945 23.2307 61.9430 12.5691 90.3881 31.4620 360.8838 5.4536 5.3851 2.7039 3.2241 0.6277 1.6022 2.5419 2.7274 2.2052 8.0444 222.4664 219.4089 220.1428
temp: 298.150 k
press: 1.00000 atm
elementType: 6 6 6 6 7 1 1 6 8 6 7 6 1 1 6 1 1 6 6 7 6 1 6 1 16 6 6 6 6 1 6 6 1 35 1 1 1
symmnumber: 1
zpe: 741177.7 jmol-1
zpe.correction: 0.282300 hartree
zpe.thermalcorrener: 0.300298 hartree
zpe.thermalcorrenthalpy: 0.301243 hartree
zpe.thermalcorrgfe: 0.235755 hartree
zpe.sumelectzpe: -3904.902484 hartree
zpe.sumelectthermal: -3904.884486 hartree
zpe.sumelectthermalent: -3904.883541 hartree
zpe.sumelectthermalfe: -3904.949029 hartree
dipole: -6.0603 -3.0027 3.4352
dipole: 7.5858
quadrupole: -114.1115 -109.9387 -145.3875
quadrupole: 9.0075 -9.1940 -14.8522
quadrupole: 9.0344 13.2072 -22.2416 9.0075 -9.1940 -14.8522
hfenergy: -3905.1847841 hartree
pointgroup: C01 [X(C18H13Br1N3O1S1)]
dipole: -2.2083394 -1.1951657 1.2046344 debye
polarizability: 273.0266747|-19.385791|316.6456409|-31.8707638|-2.7582436|190.1671745 unknown
InChI: InChI=1/C18H13BrN3OS/c19-10-1-3-18-9(5-10)6-11(24-18)22-16-13(18)14-12-8(2-4-20-14)7-21-15(12)17(16)23/h1,3,5-7,11,20-22H,2,4H2
charge 1 multiplicity 1
37 atoms
C  -4.16618063 -2.31587529 1.36106118
C  -2.78769719 -2.44071606 1.28343295
C  -2.29230772 -1.13057989 1.21666236
C  -3.3457554 -0.24895972 1.22958242
N  -4.48414856 -0.98683454 1.32766677
H  -5.41931042 -0.60373412 1.36811537
H  -4.93743531 -3.06618862 1.43324863
C  -3.13631039 1.15469275 0.99598016
O  -3.97260606 2.0222054 0.94155491
C  -0.90404231 -0.75765272 1.04236971
N  -0.0676331 -1.78206149 1.10922976
C  -0.45240807 -3.11218917 1.63364453
H  0.32497147 -3.80987462 1.32777205
H  -0.44630933 -3.04711491 2.72611884
C  -1.82815772 -3.58347311 1.15138607
H  -1.77480023 -3.89839393 0.10492678
H  -2.12297559 -4.45135345 1.7423616
C  -0.57677139 0.60498067 0.8076143
C  -1.65237948 1.50887578 0.75961794
N  -1.50224175 2.80028398 0.52166786
C  -0.19393145 3.40341411 0.25265121
H  -0.28495476 4.48494802 0.29686521
C  0.31711269 2.8372704 -1.05521079
H  -2.34690614 3.36748653 0.5582467
S  0.96629465 2.77262284 1.52221866
C  0.88009274 1.63735021 -0.87905287
C  1.49068613 0.76491159 -1.86751861
C  0.83560041 1.17724583 0.5786515
C  2.35994578 -0.16501858 -1.44101353
H  1.29421272 0.91848883 -2.92145113
C  1.99733649 0.29272192 0.93439912
C  2.71234971 -0.31031343 -0.02237416
H  2.26151097 0.18559263 1.982152
Br 3.23555432 -1.31660779 -2.64776592
H  3.57532527 -0.91723443 0.22644138
H  0.91934935 -1.60623809 0.96408846
H  0.15252931 3.33287345 -2.00316843
