program: Gaussian 16
title: Title Card Required
version: ES64L-G16RevC.01
method: RM062X
basis: 6-311+G(d,p)
operation: Freq
keyword: #N
keyword: Geom=AllCheck
keyword: Guess=TCheck
keyword: SCRF=Check
keyword: GenChk
keyword: RM062X/6-311+G(d,p)
keyword: Freq
converged: YES YES YES YES
title: Mulliken charges:
elementType: C C C C N H H C O C N C H H C H H C C N C H C H H H C C C C H C C Br H H H H Br
charge: -0.093566 0.928634 1.464416 -0.536966 -0.080505 0.401417 0.211590 -0.973267 -0.168212 -0.123762 0.047100 -0.237887 0.243282 0.266330 -0.739045 0.269420 0.257463 -0.038248 0.661971 -0.192176 -0.356989 0.265141 -0.007325 0.271055 0.263694 0.404285 -0.398949 -0.257028 -2.043616 0.668161 0.228508 1.090666 -1.081241 0.114353 0.251908 0.365117 0.239006 0.274414 0.140849
chargesum: 2.00000
title: Mulliken charges with hydrogens summed into heavy atoms:
elementType: C C C C N C O C N C C C C N C C C C C C C C Br Br
charge: 0.118024 0.928634 1.464416 -0.536966 0.320912 -0.973267 -0.168212 -0.123762 0.412217 0.271725 -0.212162 -0.038248 0.661971 0.212109 0.182566 0.527425 -0.398949 -0.028520 -1.804609 0.668161 1.090666 -0.829333 0.114353 0.140849
1716.lowfreq: -1.6437 0.0028 0.0041 0.0072 5.3701 9.0359 28.2372 42.3657 52.2589
frequency: 28.2045 42.3619 52.2473 74.0934 112.5207 123.2731 137.6028 153.6543 176.6810 197.9430 199.2059 225.1388 226.4990 281.7731 298.8897 308.2482 327.8143 334.0730 339.1647 376.3560 400.1390 405.6661 422.9357 487.3447 496.6467 510.0923 546.7277 565.9462 579.9520 585.6187 610.5261 614.3962 641.5497 656.7555 696.2073 706.7820 720.6489 741.3000 747.3013 776.2789 783.0433 799.8910 802.0686 858.9279 878.2048 890.1192 898.5956 912.1418 922.7260 924.8831 942.8627 946.0430 966.4503 1003.7119 1033.3729 1051.6971 1065.4086 1069.7191 1084.7169 1091.6322 1119.0930 1130.4627 1139.1395 1164.8448 1208.4851 1223.6571 1233.1678 1251.3972 1264.8998 1291.2801 1303.0364 1311.3501 1323.1113 1350.3414 1370.1521 1377.6387 1389.1379 1394.2866 1406.0036 1413.1858 1438.7305 1463.5692 1472.0919 1482.1643 1485.2813 1491.3024 1500.8919 1506.5025 1544.4778 1594.1824 1608.0171 1642.3093 1676.4023 1703.0786 1739.1262 1859.2005 3075.9622 3084.7417 3085.0409 3096.4802 3138.9887 3143.2329 3154.4296 3170.6375 3191.3153 3216.4055 3225.0724 3280.5316 3401.1527 3586.9990 3606.3402
redmass: 11.3048 6.7014 9.0032 7.0467 8.3514 5.8414 8.5492 3.3930 3.8252 4.0252 6.3560 3.8837 3.4099 3.3231 5.9907 2.5415 3.8893 6.6360 5.9260 7.4672 5.6814 5.8712 5.0690 5.1742 4.8519 4.9930 6.2271 4.1463 4.2950 4.6083 3.6058 3.5492 2.7146 4.2179 4.7522 1.5047 1.4798 3.1970 5.7780 6.2104 5.0476 4.3215 3.7492 4.1227 1.7231 1.6387 2.3016 2.4404 1.3834 1.3262 2.8973 2.7679 4.1366 2.3709 1.9759 2.4682 2.1345 2.1562 2.6725 2.3449 2.0471 2.5890 2.3139 3.0561 2.5454 2.0695 1.4757 1.1899 1.4522 1.5000 1.3106 1.4549 1.7327 2.5912 1.4146 1.7635 1.4644 1.7664 1.7040 1.9335 2.7803 3.0533 1.7574 1.1345 1.1295 1.5080 1.2865 1.2610 5.7758 6.4942 6.4925 5.5542 7.1212 6.2292 6.7292 11.5405 1.0699 1.0649 1.0638 1.0641 1.1036 1.0989 1.1047 1.1014 1.0899 1.0933 1.0947 1.1011 1.0777 1.0779 1.0836
irintensity: 0.2618 1.5414 4.0021 0.7492 4.0674 0.9538 1.1869 9.1700 2.2694 3.1049 2.6189 1.3012 0.9100 8.7097 1.4562 1.9016 2.3125 23.8347 1.7898 5.8422 9.3062 8.3124 1.1375 10.3918 1.1836 2.2678 7.5302 4.0254 26.5683 4.7225 8.4200 2.2235 1.6465 1.5442 1.4947 97.8812 26.4673 16.9413 1.8047 78.4613 28.6889 3.1849 37.9204 7.7293 18.3442 70.5827 63.4556 24.4931 21.2620 19.8981 12.3337 8.7250 11.1764 6.7883 88.8571 10.8480 13.5701 2.2031 18.9004 39.0014 52.2254 6.6960 41.7614 54.9882 49.4008 4.2395 4.9107 5.3167 25.1512 6.1397 27.1266 14.7041 27.1125 63.5042 94.2829 15.2170 8.6091 50.9134 57.3898 11.6277 37.0987 149.9417 24.2694 50.5477 19.6978 36.6645 42.9679 40.9006 39.0638 266.2103 51.3273 107.1679 62.7160 313.0456 207.7012 356.7083 1.5819 0.5220 2.2733 4.1664 4.1879 1.4505 2.3826 0.3064 4.0017 12.0114 21.0587 28.6221 250.1249 258.6860 275.9084
temp: 298.150 k
press: 1.00000 atm
elementType: 6 6 6 6 7 1 1 6 8 6 7 6 1 1 6 1 1 6 6 7 6 1 6 1 1 1 6 6 6 6 1 6 6 35 1 1 1 1 35
symmnumber: 1
zpe: 802599.2 jmol-1
zpe.correction: 0.305694 hartree
zpe.thermalcorrener: 0.324847 hartree
zpe.thermalcorrenthalpy: 0.325792 hartree
zpe.thermalcorrgfe: 0.257102 hartree
zpe.sumelectzpe: -6081.715507 hartree
zpe.sumelectthermal: -6081.696354 hartree
zpe.sumelectthermalent: -6081.695409 hartree
zpe.sumelectthermalfe: -6081.764099 hartree
dipole: -11.4844 -0.2493 -0.8178
dipole: 11.5161
quadrupole: -87.0634 -83.5628 -133.9567
quadrupole: 7.4028 -16.2411 -15.7201
quadrupole: 14.4642 17.9648 -32.4290 7.4028 -16.2411 -15.7201
hfenergy: -6082.021201 hartree
pointgroup: C01 [X(C18H15Br2N3O1)]
dipole: -4.002574 -0.0924122 -0.2906249 debye
polarizability: 289.3872999|-16.6284308|276.8446585|-44.6889923|-4.459737|219.6056933 unknown
InChI: InChI=1/C18H15Br2N3O/c19-9-5-10(20)14-17(6-9)2-4-22-16-13(24)12-11-8(7-23-12)1-3-21-15(11)18(14,16)17/h5-7,14,21-23H,1-4H2
charge 2 multiplicity 1
39 atoms
C  -3.9691747 -2.62872075 1.38196466
C  -2.71655349 -2.61468668 0.78471511
C  -2.3844545 -1.26043624 0.63778142
C  -3.43062894 -0.48367397 1.11537
N  -4.37576639 -1.33988766 1.57403968
H  -5.25949972 -1.06133139 1.98842865
H  -4.59806515 -3.45575508 1.67562128
C  -3.46232829 0.93581126 0.94877667
O  -4.31149798 1.72619826 1.25809678
C  -1.18099221 -0.77716593 0.02853829
N  -0.29309985 -1.68173477 -0.26639761
C  -0.37577541 -3.09952124 0.19445111
H  0.26600507 -3.68047932 -0.4649189
H  0.05697595 -3.10862163 1.19925142
C  -1.80232156 -3.65603428 0.21597079
H  -2.13099499 -3.91509854 -0.79481232
H  -1.79857683 -4.57545471 0.80237374
C  -1.02876 0.67425391 -0.17267122
C  -2.21808984 1.46421937 0.16857226
N  -2.34052435 2.71042399 -0.12641786
C  -1.42655982 3.50641521 -0.9579259
H  -2.0374737 4.21531836 -1.51686432
C  -0.65662284 2.5929293 -1.89379863
H  0.14083165 3.17315628 -2.3620081
H  -1.30985357 2.2268716 -2.69044165
H  -3.19835056 3.14822226 0.23481686
C  -0.02840395 1.39519066 -1.1920475
C  0.85661878 0.59532504 -2.06352131
C  0.31703523 1.44146491 0.24096634
C  2.00052435 0.06719485 -1.58131659
H  0.62618546 0.55826804 -3.12215068
C  1.49977874 0.70408158 0.70733634
C  2.33537901 0.10699546 -0.16299649
Br 3.20125798 -0.8299623 -2.70841069
H  3.25283039 -0.36067147 0.17441495
H  0.55161394 -1.40953921 -0.75551588
H  0.07892558 2.31770814 0.83477911
H  -0.7747965 4.08339255 -0.29741584
Br 1.81094904 0.71847013 2.55215201
