program: Gaussian 16
title: Title Card Required
version: ES64L-G16RevC.01
method: RM062X
basis: 6-311+G(d,p)
operation: Freq
keyword: #N
keyword: Geom=AllCheck
keyword: Guess=TCheck
keyword: SCRF=Check
keyword: GenChk
keyword: RM062X/6-311+G(d,p)
keyword: Freq
converged: YES YES YES YES
title: Mulliken charges:
elementType: C C C C N H H C O C N C H H C H H C C N C H C H H H C C C C H C C H Br H H H
charge: -0.189853 0.787575 0.854855 -0.327330 -0.130009 0.362796 0.174704 -1.044549 -0.249225 -0.702099 0.192310 -0.244447 0.215422 0.197357 -0.833583 0.214997 0.231553 0.224783 0.312775 -0.220859 -0.358875 0.225671 -0.473406 0.250417 0.259406 0.355694 -0.082915 -0.136120 0.227008 0.709646 0.205389 -0.466146 -0.500331 0.208056 0.086895 0.208082 0.244576 0.209779
chargesum: 1.00000
title: Mulliken charges with hydrogens summed into heavy atoms:
elementType: C C C C N C O C N C C C C N C C C C C C C C Br
charge: -0.015149 0.787575 0.854855 -0.327330 0.232787 -1.044549 -0.249225 -0.702099 0.192310 0.168332 -0.387033 0.224783 0.312775 0.134836 0.076575 0.036417 -0.082915 0.069268 0.471584 0.709646 -0.258090 -0.292249 0.086895
1716.lowfreq: -90.7745 -4.6595 -3.0913 0.0037 0.0067 0.0080 4.9863 38.4797 50.9923
frequency: -90.7724 38.4739 50.9847 70.6562 107.2183 135.5684 148.5864 164.9354 178.1697 189.8100 229.8791 249.1661 295.7623 301.1311 312.4305 333.5686 342.3738 373.7686 390.9755 411.3101 420.9394 467.9413 485.8865 521.2396 528.9658 547.3072 563.5801 590.4398 602.1595 619.0194 630.0725 646.6505 657.2361 689.7476 690.5175 740.8495 746.0888 779.6225 794.5291 808.9491 817.2078 856.1002 865.6008 889.6017 915.5010 933.0142 945.1850 948.2898 981.9990 1013.3067 1019.1442 1049.0243 1053.0046 1070.1645 1080.7686 1089.7393 1092.5393 1112.9344 1134.3812 1154.3308 1196.0075 1203.4655 1211.0634 1227.8799 1232.9267 1252.3334 1283.0909 1297.0184 1314.9450 1316.9749 1350.6838 1359.8240 1371.3226 1379.7812 1401.0597 1416.8642 1427.3393 1442.3961 1448.3510 1478.6456 1484.8014 1496.1220 1500.8388 1517.3362 1527.6340 1529.6520 1569.4112 1597.8476 1619.9686 1652.7565 1669.7179 1720.1403 1812.9647 3042.6968 3059.1504 3066.0409 3071.6941 3097.9635 3103.2004 3128.4753 3132.7388 3139.5146 3217.1667 3220.7267 3247.7242 3282.6123 3547.5174 3664.6898
redmass: 5.5815 5.9272 8.0943 5.2466 7.1132 4.3747 3.9386 4.9285 4.6994 4.5767 3.8783 4.9467 3.1209 4.3172 2.2249 7.0784 4.4282 4.6059 6.0446 6.5006 4.4714 4.1894 4.0465 4.4646 6.6860 3.8627 3.4619 2.4927 2.4553 3.8376 3.6232 3.2672 3.5000 1.8837 2.0501 4.7024 3.4082 10.3310 2.4900 4.4057 2.1955 2.2046 1.5433 1.5898 2.9287 2.5497 3.5097 2.5415 4.9166 1.3835 2.6484 2.3123 2.5960 3.1371 2.7045 2.5830 1.9736 1.6950 2.3134 2.0649 2.1690 1.2461 1.2719 1.5674 1.3804 1.3743 1.3888 1.5763 1.2850 2.0348 2.6778 1.6477 1.5944 1.4360 1.5602 3.2949 2.9860 1.3293 1.5796 1.4416 1.4478 1.7300 3.0111 5.8616 1.6542 2.0184 1.9730 6.1702 6.0284 8.1701 6.2189 10.0988 11.7763 1.0721 1.0641 1.0661 1.0710 1.0859 1.0934 1.0941 1.0972 1.0986 1.0913 1.0933 1.0976 1.0989 1.0764 1.0822
irintensity: 88.9379 0.4932 15.8374 6.1534 3.0435 1.1992 0.2155 3.7262 3.4979 1.3086 13.4048 25.3799 2.6059 9.6660 3.0029 15.4717 47.2554 5.2931 2.9910 3.0677 2.5002 23.8360 11.2633 59.7766 20.1585 5.6783 20.6389 28.2422 50.5028 10.9575 8.6354 24.1499 24.5045 44.1958 27.3185 12.9808 1.9659 1.3426 0.8151 4.1818 31.8835 9.5900 6.6214 20.8816 2.2910 17.9382 7.6662 6.7822 4.9904 26.9063 13.0213 31.7930 20.3202 30.1363 17.4851 145.6339 11.0089 21.8276 112.3507 18.8010 8.9713 20.6046 2.6645 11.4732 12.0381 24.3134 6.1680 8.3970 42.5540 59.2664 63.1711 46.2981 14.4186 0.5641 105.4459 89.0639 36.7883 82.4641 49.7490 16.2495 51.4828 67.0963 389.1775 14.0628 0.7281 11.4877 90.0530 139.8314 387.7518 55.5233 247.9246 54.4640 540.5814 6.8653 2.0089 11.1423 22.0803 1.0748 0.8337 12.2005 8.7368 1.2977 0.8961 2.3309 5.4126 4.9320 256.1558 212.0080
temp: 298.150 k
press: 1.00000 atm
elementType: 6 6 6 6 7 1 1 6 8 6 7 6 1 1 6 1 1 6 6 7 6 1 6 1 1 1 6 6 6 6 1 6 6 1 35 1 1 1
symmnumber: 1
zpe: 790799.9 jmol-1
zpe.correction: 0.301200 hartree
zpe.thermalcorrener: 0.318448 hartree
zpe.thermalcorrenthalpy: 0.319393 hartree
zpe.thermalcorrgfe: 0.255874 hartree
zpe.sumelectzpe: -3507.869457 hartree
zpe.sumelectthermal: -3507.852208 hartree
zpe.sumelectthermalent: -3507.851264 hartree
zpe.sumelectthermalfe: -3507.914783 hartree
dipole: 24.1180 10.8722 -2.6795
dipole: 26.5907
quadrupole: 17.7641 -77.8407 -129.1809
quadrupole: 67.0454 -20.2866 -15.5651
quadrupole: 80.8500 -14.7549 -66.0951 67.0454 -20.2866 -15.5651
hfenergy: -3508.1706564 hartree
pointgroup: C01 [X(C18H15Br1N3O1)]
dipole: -0.1605764 0.8466326 0.1483951 debye
polarizability: 331.2140181|-34.6054449|277.2019299|-45.8116593|-12.3481977|173.9140751 unknown
InChI: InChI=1/C18H15BrN3O/c19-11-1-2-12-9(7-11)3-5-21-17-14(12)15-13-10(4-6-20-15)8-22-16(13)18(17)23/h1-2,7-8,12,21-22H,3-6H2
charge 1 multiplicity 1
38 atoms
C  1.24389389 -0.7239612 0.48660574
C  2.62482264 -0.70267639 0.35174447
C  2.957869 0.63603433 0.13748548
C  1.81981561 1.40519989 0.1543615
N  0.7698749 0.55343774 0.36157341
H  -0.2009603 0.82854755 0.40546342
H  0.5660513 -1.54411336 0.66430394
C  1.88192158 2.83190523 0.04169111
O  0.96119998 3.61742833 0.04248398
C  4.31810859 1.12177455 0.00150839
N  5.29823194 0.31424772 -0.14322409
C  4.98364258 -1.11928717 -0.27703995
H  4.83853715 -1.2874392 -1.3516044
H  5.87716109 -1.67482447 0.00719235
C  3.76131408 -1.67097089 0.48995611
H  3.52365919 -2.66244627 0.10192143
H  4.00738173 -1.78853428 1.55022404
C  4.44865286 2.58254122 0.02777541
C  3.32691277 3.37576916 -0.09176094
N  3.31852732 4.7012431 -0.30162979
C  4.36705056 5.4779637 -0.95790812
H  3.87490332 6.26943908 -1.52292238
C  5.18715424 4.62971511 -1.91825213
H  5.88867073 5.29212585 -2.43576588
H  4.55122157 4.18918554 -2.69428276
H  2.38669379 5.10537656 -0.26269431
C  5.99888801 3.54732073 -1.26286081
C  6.89572163 2.7969128 -2.01132848
C  5.84278864 3.27743223 0.17476488
C  7.84233918 2.02680416 -1.35148707
H  6.92604079 2.8897264 -3.09028548
C  6.89346547 2.43895572 0.7947019
C  7.8922631 1.90005409 0.06790014
H  6.85065142 2.29477266 1.86854425
Br 9.12254311 1.12074469 -2.34939465
H  8.67878399 1.31408341 0.52325639
H  5.67355675 4.17006839 0.78164503
H  5.01315982 5.9697733 -0.2254811
