program: Gaussian 16
title: Scaling factors
version: ES64L-G16RevC.01
frameworkgroup: TD[O(C),4C3(H)]
method: RPBE0DH-FC
basis: 6-311++G(2d,2p)
operation: Freq
keyword: #N
keyword: Geom=AllCheck
keyword: Guess=TCheck
keyword: SCRF=Check
keyword: GenChk
keyword: RPBE0DH(FC)/6-311++G(2d,2p)
keyword: Freq
converged: YES YES YES YES
title: Mulliken charges:
elementType: C H H H H
charge: -0.248380 0.062095 0.062095 0.062095 0.062095
chargesum: 0.00000
title: Mulliken charges with hydrogens summed into heavy atoms:
elementType: C
charge: 0.000000
1716.lowfreq: -0.0012 -0.0009 -0.0007 7.6545 7.6545 7.6545 1355.6073 1355.6073 1355.6073
frequency: 1355.6073 1355.6073 1355.6073 1583.9827 1583.9827 3089.9385 3212.0991 3212.0991 3212.0991
redmass: 1.1794 1.1794 1.1794 1.0078 1.0078 1.0078 1.1013 1.1013 1.1013
irintensity: 14.3383 14.3383 14.3383 0.0000 0.0000 0.0000 18.9352 18.9352 18.9352
temp: 298.150 k
press: 1.00000 atm
elementType: 6 1 1 1 1
symmnumber: 12
zpe: 119393.4 jmol-1
zpe.correction: 0.045475 hartree
zpe.thermalcorrener: 0.048341 hartree
zpe.thermalcorrenthalpy: 0.049285 hartree
zpe.thermalcorrgfe: 0.028173 hartree
zpe.sumelectzpe: -40.430111 hartree
zpe.sumelectthermal: -40.427244 hartree
zpe.sumelectthermalent: -40.426300 hartree
zpe.sumelectthermalfe: -40.447412 hartree
dipole: 0.0000 0.0000 0.0000
dipole: 0.0000
quadrupole: -8.3347 -8.3347 -8.3347
quadrupole: 0.0000 -0.0000 -0.0000
quadrupole: 0.0000 0.0000 -0.0000 0.0000 -0.0000 -0.0000
hfenergy: -40.447966 hartree
pointgroup: TD [O(C1),4C3(H1)]
dipole: 0. 0. 0. debye
dipolederiv: -0.0204184 0. 0. 0. -0.0204184 0. 0. 0. -0.0204184 0.0051046 -0.0654395 -0.0654395 -0.0654395 0.0051046 -0.0654395 -0.0654395 -0.0654395 0.0051046 0.0051046 -0.0654395 0.0654395 -0.0654395 0.0051046 0.0654395 0.0654395 0.0654395 0.0051046 0.0051046 0.0654395 -0.0654395 0.0654395 0.0051046 0.0654395 -0.0654395 0.0654395 0.0051046 0.0051046 0.0654395 0.0654395 0.0654395 0.0051046 -0.0654395 0.0654395 -0.0654395 0.0051046 unknown
polarizability: 15.1637241|0.|15.1637241|0.|0.|15.163724 unknown
InChI: InChI=1S/CH4/h1H4
charge 0 multiplicity 1
5 atoms
C  0.0000 0.0000 0.0000
H  0.62634188 0.62634188 0.62634188
H  -0.62634188 -0.62634188 0.62634188
H  -0.62634188 0.62634188 -0.62634188
H  0.62634188 -0.62634188 -0.62634188
