program: Gaussian 16
title: Scaling factors
version: ES64L-G16RevC.01
frameworkgroup: C*V[C*(HO)]
method: RPBE0DH-FC
basis: 6-311++G(2d,2p)
operation: Freq
keyword: #N
keyword: Geom=AllCheck
keyword: Guess=TCheck
keyword: SCRF=Check
keyword: GenChk
keyword: RPBE0DH(FC)/6-311++G(2d,2p)
keyword: Freq
converged: YES YES YES YES
1716.lowfreq: -0.0020 -0.0018 0.0011 11.8080 28.8056 3205.4803
frequency: 3205.4803
redmass: 1.0671
irintensity: 319.9975
temp: 298.150 k
press: 1.00000 atm
elementType: 8 1
symmnumber: 1
zpe: 19173.0 jmol-1
zpe.correction: 0.007303 hartree
zpe.thermalcorrener: 0.009663 hartree
zpe.thermalcorrenthalpy: 0.010607 hartree
zpe.thermalcorrgfe: -0.009062 hartree
zpe.sumelectzpe: -75.074197 hartree
zpe.sumelectthermal: -75.071837 hartree
zpe.sumelectthermalent: -75.070893 hartree
zpe.sumelectthermalfe: -75.090562 hartree
hfenergy: -75.0589148 hartree
pointgroup: C*V [C*(H1O1)]
dipole: 0. 0. -0.8063329 debye
dipolederiv: 0.4721721 0. 0. 0. 0.4721569 0. 0. 0. 0.3828701 0.5278279 0. 0. 0. 0.5278431 0. 0. 0. 0.6171299 unknown
polarizability: 2.7563132|0.|2.8432034|0.|0.|4.6738223 unknown
InChI: InChI=1S/HO/h1H
charge 1 multiplicity 1
2 atoms
O  0.0000 0.0000 0.12688511
H  0.0000 0.0000 -0.89707411
