program: Gaussian 16
title: Title Card Required
version: ES64L-G16RevC.01
basis: 6-311++G(2d,2p)
frameworkgroup: C1[X(C9H10O4)]
method: RPBE1PBE
operation: FOpt
keyword: #
keyword: opt
keyword: 6-311++g(2d,2p)
keyword: geom=connectivity
keyword: pbe1pbe
title: # opt 6-311++g(2d,2p) geom=connectivity pbe1pbe
nucrepener: 788.3751669197
converged: YES YES YES YES
title: Mulliken charges:
elementType: C C C C C C C C O O O H H H H H H H O C H H H
charge: 0.612341 -0.419776 0.003594 0.240390 -0.021697 -0.058354 0.230930 -0.079588 -0.410915 -0.372031 -0.429727 0.159944 0.050172 0.112262 0.069268 0.114249 0.097872 0.280288 -0.437004 -0.029924 0.116762 0.086833 0.084109
chargesum: -0.00000
charge: 0.659281 -0.366459 0.314834 0.127288 0.034373 -0.306505 0.241426 -0.046717 -0.410251 -0.522535 -0.455588 0.116062 0.048924 0.088601 0.121636 0.103315 0.103357 0.301325 -0.420052 -0.041264 0.127269 0.090838 0.090841
dipole: -0.8294 1.8678 0.0015
dipole: 2.0437
quadrupole: -63.9388 -82.5471 -77.1776
quadrupole: 19.3386 -0.0053 0.0012
quadrupole: 10.6157 -7.9926 -2.6232 19.3386 -0.0053 0.0012
hfenergy: -649.3124976 hartree
pointgroup: C01 [X(C9H10O4)]
dipole: -0.5112578 0.6158707 0.0762054 debye
InChI: InChI=1S/C9H10O4/c1-12-7-3-6(5-10)4-8(13-2)9(7)11/h3-5,11H,1-2H3
charge 0 multiplicity 1
23 atoms
C  1.06719457 -0.78229564 -0.23514069
C  -0.25227413 -1.22712374 -0.28409216
C  -1.26786137 -0.30123828 -0.16764278
C  -0.98416365 1.06153448 -0.00308307
C  0.34177833 1.50116398 0.04521936
C  1.36378049 0.56869116 -0.07207635
C  2.16826857 -1.74246486 -0.35605591
C  -2.98729907 -1.9204193 -0.35768889
O  2.03730637 -2.93533364 -0.5005027
O  -2.60057231 -0.57055017 -0.19521515
O  -1.98180097 1.95450306 0.10930536
H  -0.43721469 -2.28431458 -0.41182407
H  2.40014354 0.87787013 -0.03847946
H  3.18080946 -1.28989782 -0.30509419
H  -4.07423298 -1.92697348 -0.35447888
H  -2.62228921 -2.32100943 -1.30648453
H  -2.61577825 -2.53601745 0.46505813
H  -2.81041273 1.4646016 0.0531366
O  0.50909598 2.83112565 0.20637962
C  1.83157354 3.31463268 0.25838747
H  1.75238952 4.39101896 0.38857458
H  2.38027245 2.88879334 1.10371199
H  2.37181093 3.10253412 -0.66903959
