program: Gaussian 16
title: Title CardRequired
version: ES64L-G16RevC.01
basis: 6-311++G(2d,2p)
frameworkgroup: C1[X(C10H12O)]
method: RPBE1PBE
operation: FOpt
keyword: #
keyword: opt
keyword: 6-311++g(2d,2p)
keyword: geom=connectivity
keyword: pbe1pbe
title: # opt 6-311++g(2d,2p) geom=connectivity pbe1pbe
title: Title Card Required
nucrepener: 571.2495714161
converged: YES YES YES YES
title: Mulliken charges:
elementType: C C C C C C C O H H H H H C H C H H H C H H H
charge: 0.397988 -0.246465 -0.439982 0.964909 -0.595339 -0.771499 0.409752 -0.403588 0.130259 0.072497 0.091224 0.121427 0.097628 0.463813 0.077002 -0.387541 0.077165 0.111467 0.083033 -0.490697 0.089532 0.072084 0.075329
chargesum: -0.00000
charge: 0.329444 -0.041850 -0.319419 0.779689 -0.456011 -0.846078 0.504102 -0.383487 0.127789 0.073961 0.096036 0.092383 0.094226 0.273941 0.097591 -0.484840 0.078762 0.102269 0.092775 -0.485086 0.102224 0.078777 0.092802
dipole: -3.9748 1.1712 0.0007
dipole: 4.1438
quadrupole: -78.6424 -60.7528 -68.6400
quadrupole: 5.9534 0.0040 0.0059
quadrupole: -9.2973 8.5922 0.7051 5.9534 0.0040 0.0059
hfenergy: -463.0994519 hartree
pointgroup: C01 [X(C10H12O1)]
dipole: -1.4609076 0.5934387 0.4140337 debye
InChI: InChI=1S/C10H12O/c1-8(2)10-5-3-9(7-11)4-6-10/h3-8H,1-2H3
charge 0 multiplicity 1
23 atoms
C  1.8456154 0.16128266 -0.01383435
C  1.11781914 -0.87159109 -0.60050063
C  -0.26294308 -0.86272763 -0.53872305
C  -0.9530146 0.16738092 0.10430556
C  -0.21408027 1.19640731 0.68825691
C  1.16856147 1.19377449 0.63010519
C  3.3164065 0.17517667 -0.06573537
O  3.99702221 -0.6677941 -0.59670766
H  1.65513552 -1.66920117 -1.09852332
H  -0.72440178 2.00785469 1.19346264
H  1.73519515 1.99837228 1.08711751
H  3.7876617 1.04672593 0.43515339
H  -0.82628501 -1.66822804 -0.99644621
C  -2.46279099 0.15923225 0.1613333
H  -2.79481318 -0.74152489 -0.36359497
C  -3.06012507 1.36585918 -0.5619018
H  -2.72216388 1.41598019 -1.59799367
H  -4.15055974 1.30981852 -0.56065579
H  -2.77600469 2.29993231 -0.07214284
C  -2.97131484 0.07328418 1.60004147
H  -4.06116148 0.00870601 1.61612341
H  -2.56995708 -0.80242268 2.11215724
H  -2.68342868 0.95705903 2.17375197
