program: Gaussian 16
title: Title CardRequired
version: ES64L-G16RevC.01
basis: 6-311++G(2d,2p)
frameworkgroup: C1[X(C10H12O)]
method: RPBE1PBE
operation: FOpt
keyword: #
keyword: opt
keyword: 6-311++g(2d,2p)
keyword: geom=connectivity
keyword: pbe1pbe
title: # opt 6-311++g(2d,2p) geom=connectivity pbe1pbe
title: Title Card Required
nucrepener: 571.2868873702
converged: YES YES YES YES
title: Mulliken charges:
elementType: C C C C C C C O H H H H H C H C H H H C H H H
charge: 0.539058 -0.674664 -0.509103 1.019655 -0.561229 -0.406850 0.329736 -0.408215 0.082818 0.080633 0.132318 0.118837 0.089567 0.443951 0.076349 -0.476364 0.071811 0.090207 0.074306 -0.384479 0.109134 0.079199 0.083324
chargesum: -0.00000
charge: 0.500095 -0.491334 -0.436607 0.832405 -0.376599 -0.434703 0.336014 -0.391443 0.090874 0.078994 0.132675 0.090351 0.086907 0.310554 0.096043 -0.487292 0.079504 0.100593 0.094938 -0.486984 0.100629 0.079494 0.094892
dipole: -3.7176 1.8102 -0.0017
dipole: 4.1349
quadrupole: -76.1606 -62.1984 -68.6383
quadrupole: 7.3336 -0.0060 -0.0055
quadrupole: -7.1615 6.8007 0.3608 7.3336 -0.0060 -0.0055
hfenergy: -463.0995407 hartree
pointgroup: C01 [X(C10H12O1)]
dipole: -1.5548464 0.3836251 -0.2858655 debye
InChI: InChI=1S/C10H12O/c1-8(2)10-5-3-9(7-11)4-6-10/h3-8H,1-2H3
charge 0 multiplicity 1
23 atoms
C  1.82922377 0.24627467 -0.00468081
C  0.97251532 1.17685727 -0.58156946
C  -0.40012475 0.99069866 -0.52786503
C  -0.94506434 -0.12525977 0.10117574
C  -0.07289861 -1.05533101 0.67841732
C  1.29438358 -0.87627118 0.62857727
C  3.28418269 0.4571019 -0.06950891
O  4.11165088 -0.28666454 0.39728585
H  1.38642044 2.05036108 -1.07438886
H  -0.47511063 -1.93149648 1.17345598
H  1.97304129 -1.5933042 1.07380957
H  3.59277122 1.38365901 -0.59760525
H  -1.0616809 1.72080256 -0.98012452
C  -2.44180552 -0.32203197 0.15584779
H  -2.89294427 0.53054662 -0.36081196
C  -2.95736185 -0.32031249 1.59465347
H  -2.67957304 0.59705218 2.11572396
H  -4.04579733 -0.40549595 1.60962083
H  -2.55151167 -1.16175721 2.16047604
C  -2.86952433 -1.59147518 -0.58007489
H  -3.95744498 -1.68425062 -0.57921381
H  -2.52831593 -1.58466615 -1.6163042
H  -2.46077352 -2.48314029 -0.0997028
