program: Gaussian 16
title: Title CardRequired
version: ES64L-G16RevC.01
basis: 6-311++G(2d,2p)
frameworkgroup: C1[X(C10H12O2)]
method: RPBE1PBE
operation: FOpt
keyword: #
keyword: opt
keyword: 6-311++g(2d,2p)
keyword: geom=connectivity
keyword: pbe1pbe
title: # opt 6-311++g(2d,2p) geom=connectivity pbe1pbe
title: Title Card Required
nucrepener: 670.0544225884
converged: YES YES YES YES
title: Mulliken charges:
elementType: C C C C C C C O O H H H H H H H C H H C H C H H
charge: 0.965321 0.091311 -0.026051 -0.257287 -0.203038 -0.494686 -0.038454 -0.487520 -0.444648 0.116284 0.131596 0.076342 0.087647 0.090277 0.112035 0.290220 0.096815 0.099812 0.058432 -0.057420 0.092843 -0.424335 0.057230 0.067272
chargesum: -0.00000
charge: 1.010405 -0.154255 0.039894 -0.107468 -0.308777 -0.527937 -0.054307 -0.504843 -0.434381 0.091172 0.133147 0.098217 0.096695 0.095687 0.119798 0.290074 0.101765 0.071230 0.065244 0.076212 0.112442 -0.456763 0.063964 0.082787
dipole: -0.6055 2.7433 0.0555
dipole: 2.8099
quadrupole: -66.5486 -68.7069 -73.1872
quadrupole: -8.3687 0.9734 -0.1706
quadrupole: 2.9323 0.7740 -3.7063 -8.3687 0.9734 -0.1706
hfenergy: -538.2377593 hartree
pointgroup: C01 [X(C10H12O2)]
dipole: -0.1190329 1.0569014 0.3014693 debye
InChI: InChI=1S/C10H12O2/c1-3-4-8-5-6-9(11)10(7-8)12-2/h3,5-7,11H,1,4H2,2H3
charge 0 multiplicity 1
24 atoms
C  0.97840548 0.0301235 0.19010397
C  -0.14666197 0.84545725 0.32445997
C  -1.41573553 0.33970282 0.09841318
C  -1.58423251 -0.99921686 -0.27154882
C  -0.4727554 -1.80757334 -0.40996124
C  0.79819046 -1.29494895 -0.18209883
C  -2.50042614 2.39850857 0.5665425
O  -2.58176727 1.04050771 0.19820103
O  -2.82489141 -1.49542773 -0.49615388
H  -0.01791585 1.88163843 0.60988421
H  -0.61649534 -2.84049967 -0.70018929
H  1.66143927 -1.93827327 -0.30139962
H  -2.05002802 2.51346559 1.55639225
H  -1.92336238 2.97242385 -0.16386644
H  -3.52191561 2.77044778 0.59051891
H  -3.45324322 -0.78070068 -0.35083221
C  2.35780789 0.58204404 0.46786521
H  2.72523736 0.20806828 1.42887032
H  2.28281725 1.66969771 0.56819457
C  3.35691816 0.25731111 -0.5977929
H  3.10424686 0.58955106 -1.60170907
C  4.49210983 -0.39912908 -0.39819293
H  4.77255657 -0.75450345 0.58781464
H  5.17992051 -0.60163169 -1.20961454
