program: Gaussian 16
title: Title CardRequired
version: ES64L-G16RevC.01
basis: 6-311++G(2d,2p)
frameworkgroup: C1[X(C10H12O2)]
method: RPBE1PBE
operation: FOpt
keyword: #
keyword: opt
keyword: 6-311++g(2d,2p)
keyword: geom=connectivity
keyword: pbe1pbe
title: # opt 6-311++g(2d,2p) geom=connectivity pbe1pbe
title: Title Card Required
nucrepener: 665.4914460156
converged: YES YES YES YES
title: Mulliken charges:
elementType: C C C C C C C O O H H H H H H H C H H C H C H H
charge: 1.432227 0.536994 -0.325338 -0.143806 -0.128910 -1.119168 -0.034473 -0.419517 -0.429548 0.102837 0.072100 0.070352 0.083960 0.081758 0.112638 0.253030 -0.533107 0.082124 0.072612 0.424748 0.131091 -0.476366 0.072622 0.081141
chargesum: -0.00000
charge: 1.070232 -0.144027 -0.216923 0.004807 -0.125534 -0.613906 -0.050572 -0.410485 -0.410179 0.094717 0.073974 0.098505 0.087731 0.086525 0.125860 0.244630 0.049026 0.071671 0.066032 0.094569 0.113725 -0.457437 0.063948 0.083110
dipole: -0.5197 -0.3049 0.1076
dipole: 0.6121
quadrupole: -74.8542 -58.3820 -73.2960
quadrupole: -2.5426 -0.4679 -0.1967
quadrupole: -6.0101 10.4621 -4.4519 -2.5426 -0.4679 -0.1967
hfenergy: -538.231146 hartree
pointgroup: C01 [X(C10H12O2)]
dipole: -0.2012532 -0.1272556 0.0359773 debye
InChI: InChI=1S/C10H12O2/c1-3-4-8-5-6-9(11)10(7-8)12-2/h3,5-7,11H,1,4H2,2H3
charge 0 multiplicity 1
24 atoms
C  -0.93501742 -0.21756277 0.22526961
C  0.28268099 -0.87572383 0.04431631
C  1.48132817 -0.18063734 -0.03340036
C  1.46832241 1.21845272 0.06954913
C  0.26219083 1.8713841 0.24388208
C  -0.9324469 1.16468372 0.32029995
C  2.75150339 -2.14916615 -0.31622978
O  2.69694618 -0.74742659 -0.2083582
O  2.66125398 1.86251408 -0.01441239
H  0.28576411 -1.95478771 -0.03578649
H  0.25690321 2.95435346 0.31904746
H  -1.86493536 1.69971743 0.45058797
H  2.37588087 -2.63675593 0.58873303
H  2.18422463 -2.50802802 -1.18065154
H  3.8013614 -2.40001836 -0.44824036
H  2.5066611 2.80513059 0.06806068
C  -2.21868525 -1.00757557 0.33846135
H  -2.53545459 -1.05954547 1.38511364
H  -2.02045268 -2.03756927 0.02480024
C  -3.33785334 -0.45302721 -0.48511938
H  -3.14439452 -0.36747118 -1.55159833
C  -4.51210158 -0.064452 -0.00582479
H  -4.73752492 -0.12654144 1.0536554
H  -5.28802471 0.32444273 -0.65333024
