program: Gaussian 16
title: Title CardRequired
version: ES64L-G16RevC.01
basis: 6-311++G(2d,2p)
frameworkgroup: C1[X(C10H12O2)]
method: RPBE1PBE
operation: FOpt
keyword: #
keyword: opt
keyword: 6-311++g(2d,2p)
keyword: geom=connectivity
keyword: pbe1pbe
title: # opt 6-311++g(2d,2p) geom=connectivity pbe1pbe
title: Title Card Required
nucrepener: 671.1040430820
converged: YES YES YES YES
title: Mulliken charges:
elementType: C C C C C C C O O H H H H H H H C H H C H C H H
charge: 0.975809 -0.310881 0.150653 -0.157204 -0.314900 -0.339939 -0.024708 -0.428441 -0.446198 0.105403 0.129861 0.090867 0.090718 0.088600 0.120387 0.278869 0.039017 0.075795 0.062966 0.010630 0.095594 -0.420897 0.063625 0.064375
chargesum: -0.00000
charge: 0.820074 0.040568 -0.015813 -0.199444 -0.180902 -0.484600 -0.036853 -0.502152 -0.433840 0.059828 0.129214 0.083988 0.099504 0.097949 0.117685 0.288990 0.080443 0.070086 0.097905 0.073588 0.116257 -0.468627 0.066272 0.079881
dipole: -0.8539 -2.2993 -0.2565
dipole: 2.4661
quadrupole: -74.3494 -62.9386 -73.2108
quadrupole: -4.8953 0.3355 0.4480
quadrupole: -4.1831 7.2276 -3.0445 -4.8953 0.3355 0.4480
hfenergy: -538.2385041 hartree
pointgroup: C01 [X(C10H12O2)]
dipole: -0.2403135 -0.9302239 0.1352226 debye
InChI: InChI=1S/C10H12O2/c1-3-4-8-5-6-9(11)10(7-8)12-2/h3,5-7,11H,1,4H2,2H3
charge 0 multiplicity 1
24 atoms
C  -0.84956593 1.06956897 -0.33296892
C  -0.03757505 -0.01874749 -0.00103343
C  1.32742443 0.14314476 0.14416817
C  1.9138045 1.40346815 -0.03611143
C  1.11455683 2.48066583 -0.35834537
C  -0.25888626 2.31155023 -0.50418055
C  1.70720085 -2.13938618 0.66857047
O  2.21600509 -0.84021558 0.46437759
O  3.2514701 1.55973714 0.11000978
H  -0.49328627 -0.9889292 0.14864066
H  1.57746585 3.44999504 -0.49140931
H  -0.87380364 3.16695843 -0.7581288
H  0.99393228 -2.15848425 1.49697095
H  1.22334896 -2.52011221 -0.23505768
H  2.56107447 -2.76688334 0.91239049
H  3.62002762 0.69929194 0.33526252
C  -2.33670708 0.87484172 -0.51340752
H  -2.5342303 0.30000917 -1.42393255
H  -2.7950772 1.85759283 -0.6602211
C  -2.9923765 0.19363491 0.64689642
H  -2.87896967 0.68475495 1.61031712
C  -3.67328985 -0.94278184 0.57427273
H  -3.80326852 -1.46316315 -0.36897912
H  -4.13027611 -1.3870209 1.44976317
