program: Gaussian 16
title: Title CardRequired
version: ES64L-G16RevC.01
basis: 6-311++G(2d,2p)
frameworkgroup: C1[X(C10H12O2)]
method: RPBE1PBE
operation: FOpt
keyword: #
keyword: opt
keyword: 6-311++g(2d,2p)
keyword: geom=connectivity
keyword: pbe1pbe
title: # opt 6-311++g(2d,2p) geom=connectivity pbe1pbe
title: Title Card Required
nucrepener: 674.9215357427
converged: YES YES YES YES
title: Mulliken charges:
elementType: C C C C C C C O O H H H H H H H C H H C H C H H
charge: 0.927898 -0.460113 0.045166 -0.021063 -0.339911 -0.274300 -0.005366 -0.428173 -0.459538 0.104649 0.129549 0.089781 0.105126 0.103105 0.115377 0.230376 0.169678 0.066959 0.082618 -0.028986 0.114643 -0.406368 0.064283 0.074611
chargesum: -0.00000
charge: 1.010325 -0.154365 0.039887 -0.107542 -0.308658 -0.527788 -0.054320 -0.504844 -0.434374 0.091163 0.133148 0.098207 0.119797 0.096641 0.095746 0.290073 0.102051 0.071236 0.065234 0.075908 0.112429 -0.456690 0.063964 0.082773
dipole: -0.6054 -2.7433 -0.0562
dipole: 2.8099
quadrupole: -66.5501 -68.7058 -73.1875
quadrupole: 8.3685 -0.9721 -0.1725
quadrupole: 2.9310 0.7753 -3.7063 8.3685 -0.9721 -0.1725
hfenergy: -538.2377593 hartree
pointgroup: C01 [X(C10H12O2)]
dipole: -0.2501572 1.036102 0.2933265 debye
InChI: InChI=1S/C10H12O2/c1-3-4-8-5-6-9(11)10(7-8)12-2/h3,5-7,11H,1,4H2,2H3
charge 0 multiplicity 1
24 atoms
C  0.68695212 -0.6036881 0.32585068
C  -0.49666319 0.13241625 0.24908403
C  -1.65722547 -0.44614205 -0.23638664
C  -1.65501578 -1.77982518 -0.65989692
C  -0.48443283 -2.50968197 -0.58966866
C  0.67717003 -1.92421315 -0.10176041
C  -2.95455313 1.52134195 0.04740916
O  -2.86601328 0.17424406 -0.35745639
O  -2.78874862 -2.3469854 -1.13830764
H  -0.49974335 1.16450205 0.57544286
H  -0.4951747 -3.53928519 -0.92377387
H  1.58972888 -2.50619414 -0.05903036
H  -3.98424347 1.82527043 -0.12495175
H  -2.71754699 1.63154805 1.1092779
H  -2.28640787 2.15592214 -0.54146573
H  -3.48188329 -1.67965352 -1.10676848
C  1.94184515 0.02635168 0.88514061
H  2.13699715 -0.35594226 1.89219098
H  1.77234334 1.10280279 0.99112186
C  3.15248145 -0.19621591 0.03418971
H  3.08091246 0.15327916 -0.99284473
C  4.26895817 -0.78422543 0.44301931
H  4.37287395 -1.15437343 1.45758317
H  5.11634715 -0.91370976 -0.21854248
