program: Gaussian 16
title: Title CardRequired
version: ES64L-G16RevC.01
basis: 6-311++G(2d,2p)
frameworkgroup: C1[X(C10H12O2)]
method: RPBE1PBE
operation: FOpt
keyword: #
keyword: opt
keyword: 6-311++g(2d,2p)
keyword: geom=connectivity
keyword: pbe1pbe
title: # opt 6-311++g(2d,2p) geom=connectivity pbe1pbe
title: Title Card Required
nucrepener: 678.7095265513
converged: YES YES YES YES
title: Mulliken charges:
elementType: C C C C C C C O O H H H H H H H C H H C H C H H
charge: 1.168293 -1.086667 0.029772 0.139437 -0.058953 0.009023 -0.014747 -0.427340 -0.462301 0.096104 0.120830 0.090131 0.102231 0.103207 0.114256 0.230874 -0.525662 0.077091 0.076147 0.385344 0.126583 -0.447098 0.077580 0.075865
chargesum: -0.00000
charge: 0.819870 0.040819 -0.015828 -0.199327 -0.180994 -0.484672 -0.036838 -0.502146 -0.433849 0.059762 0.129211 0.083976 0.097968 0.117691 0.099485 0.288989 0.080249 0.070082 0.097884 0.073911 0.116269 -0.468689 0.066281 0.079896
dipole: 0.8550 -2.2988 0.2562
dipole: 2.4660
quadrupole: -74.3517 -62.9371 -73.2110
quadrupole: 4.8927 0.3339 -0.4474
quadrupole: -4.1851 7.2295 -3.0444 4.8927 0.3339 -0.4474
hfenergy: -538.2385041 hartree
pointgroup: C01 [X(C10H12O2)]
dipole: -0.0858152 0.9090199 -0.3280521 debye
InChI: InChI=1S/C10H12O2/c1-3-4-8-5-6-9(11)10(7-8)12-2/h3,5-7,11H,1,4H2,2H3
charge 0 multiplicity 1
24 atoms
C  0.81056339 -0.52292522 0.26307259
C  -0.34102466 0.19747062 -0.0667697
C  -1.58723346 -0.39411185 0.0199203
C  -1.71122664 -1.72429964 0.44415229
C  -0.57713523 -2.4362993 0.77565223
C  0.67488598 -1.83587616 0.68554832
C  -2.74031485 1.54887719 -0.70389001
O  -2.77555061 0.20632186 -0.27413774
O  -2.93418181 -2.30048031 0.53120094
H  -0.24441744 1.22784863 -0.38349385
H  -0.68506892 -3.46147675 1.10573488
H  1.5567927 -2.40795934 0.94877774
H  -2.1690113 1.65163881 -1.6305345
H  -3.77274912 1.83957184 -0.88244781
H  -2.30752548 2.19762978 0.0623878
H  -3.5834525 -1.64243318 0.26217062
C  2.16881748 0.12680037 0.13996861
H  2.42225566 0.27424876 -0.91480081
H  2.91564986 -0.56222002 0.54610611
C  2.26777888 1.43812186 0.85468153
H  2.05383699 1.41404311 1.9204622
C  2.58090394 2.59320346 0.28187938
H  2.79633343 2.65625397 -0.77974061
H  2.64123277 3.51140769 0.85278394
