program: Gaussian 16
title: Title CardRequired
version: ES64L-G16RevC.01
basis: 6-311++G(2d,2p)
frameworkgroup: C1[X(C10H12O2)]
method: RPBE1PBE
operation: FOpt
keyword: #
keyword: opt
keyword: 6-311++g(2d,2p)
keyword: geom=connectivity
keyword: pbe1pbe
title: # opt 6-311++g(2d,2p) geom=connectivity pbe1pbe
title: Title Card Required
nucrepener: 668.0733541954
converged: YES YES YES YES
title: Mulliken charges:
elementType: C C C C C C C O O H H H H H H H C H H C H C H H
charge: 1.016739 -0.109395 -0.203110 -0.149082 -0.134789 -0.446583 -0.037600 -0.423424 -0.426966 0.106625 0.074619 0.079786 0.083935 0.080694 0.117117 0.252015 0.204639 0.069679 0.070033 -0.094126 0.115887 -0.382745 0.062291 0.073760
chargesum: -0.00000
charge: 1.070473 -0.144088 -0.216902 0.005027 -0.125540 -0.614132 -0.050566 -0.410481 -0.410183 0.094697 0.073968 0.098544 0.087718 0.086533 0.125861 0.244634 0.048231 0.071663 0.066046 0.095300 0.113757 -0.457644 0.063948 0.083135
dipole: 0.5196 -0.3051 -0.1063
dipole: 0.6119
quadrupole: -74.8532 -58.3821 -73.2958
quadrupole: 2.5438 -0.4707 0.1985
quadrupole: -6.0095 10.4616 -4.4521 2.5438 -0.4707 0.1985
hfenergy: -538.231146 hartree
pointgroup: C01 [X(C10H12O2)]
dipole: 0.2051712 -0.1174951 -0.0452808 debye
InChI: InChI=1S/C10H12O2/c1-3-4-8-5-6-9(11)10(7-8)12-2/h3,5-7,11H,1,4H2,2H3
charge 0 multiplicity 1
24 atoms
C  0.94273931 -0.16272445 -0.20851889
C  -0.26548215 -0.86082225 -0.16796251
C  -1.48145239 -0.20449413 -0.0394473
C  -1.49632164 1.19521487 0.05499722
C  -0.29982296 1.88696345 0.01982812
C  0.9123998 1.21885017 -0.10918402
C  -2.71612825 -2.21498579 -0.08275187
O  -2.68941028 -0.81123029 0.00803369
O  -2.70569232 1.80022682 0.18278817
H  -0.24707344 -1.94031624 -0.23981985
H  -0.31621887 2.96965848 0.09729859
H  1.83659494 1.78302418 -0.12767284
H  -2.2981495 -2.56429942 -1.03200348
H  -2.17151483 -2.68153879 0.74401222
H  -3.76404853 -2.50010012 -0.02682597
H  -2.56960515 2.74761264 0.23912594
C  2.24702481 -0.90659919 -0.38242224
H  2.60087269 -0.80620066 -1.41356565
H  2.06131262 -1.97363561 -0.2227042
C  3.32427427 -0.45315381 0.55151704
H  3.09219083 -0.52093501 1.6115494
C  4.50532761 0.01911481 0.17515607
H  4.76859652 0.10975236 -0.87348454
H  5.2494459 0.32717296 0.89900092
