program: Gaussian 16
title: Title CardRequired
version: ES64L-G16RevC.01
basis: 6-311++G(2d,2p)
frameworkgroup: C1[X(C10H12O2)]
method: RPBE1PBE
operation: FOpt
keyword: #
keyword: opt
keyword: 6-311++g(2d,2p)
keyword: geom=connectivity
keyword: pbe1pbe
title: # opt 6-311++g(2d,2p) geom=connectivity pbe1pbe
title: Title Card Required
nucrepener: 669.4549840484
converged: YES YES YES YES
title: Mulliken charges:
elementType: C C C C C C C O O H H H H H H H C H H C H C H H
charge: 0.956725 -0.351063 -0.084956 0.086780 -0.207525 -0.298310 -0.044818 -0.429416 -0.425138 0.105631 0.059725 0.089656 0.101778 0.103866 0.100774 0.262907 0.033815 0.079344 0.062836 0.000766 0.092767 -0.424926 0.064001 0.064780
chargesum: -0.00000
charge: 0.908761 -0.110453 -0.370273 0.134445 0.095304 -0.765053 -0.072749 -0.346560 -0.404429 0.142488 0.069705 0.088417 0.073046 0.097570 0.099167 0.254388 0.068179 0.069507 0.089482 0.077989 0.114019 -0.456920 0.064425 0.079545
dipole: 0.5901 1.7018 -1.1876
dipole: 2.1575
quadrupole: -66.8127 -64.0019 -73.5719
quadrupole: 4.5665 -1.6557 3.0484
quadrupole: 1.3161 4.1269 -5.4431 4.5665 -1.6557 3.0484
hfenergy: -538.2288091 hartree
pointgroup: C01 [X(C10H12O2)]
dipole: 0.2510834 0.4976731 -0.6401298 debye
InChI: InChI=1S/C10H12O2/c1-3-4-8-5-6-9(11)10(7-8)12-2/h3,5-7,11H,1,4H2,2H3
charge 0 multiplicity 1
24 atoms
C  -1.03005762 0.97265866 -0.22382727
C  -0.33590946 -0.12384409 0.283085
C  1.03627848 -0.1012432 0.4637888
C  1.753161 1.05744713 0.14075376
C  1.07282468 2.15084553 -0.37147165
C  -0.30360268 2.10964703 -0.5496563
C  2.52348648 -1.89329604 0.1588339
O  1.65065638 -1.18294852 1.02393724
O  3.09554929 1.06146102 0.36279415
H  -0.86451356 -1.02678939 0.56554416
H  1.62585607 3.05127214 -0.62022833
H  -0.8131223 2.9801419 -0.94624647
H  1.97289967 -2.29456602 -0.69748597
H  3.3404978 -1.26123969 -0.19281201
H  2.92886917 -2.71709828 0.74310016
H  3.44646711 1.92149337 0.12471235
C  -2.52562238 0.90997513 -0.42593927
H  -2.76582177 0.21847875 -1.23958705
H  -2.87126393 1.89819434 -0.74512508
C  -3.27407477 0.49799351 0.80333694
H  -3.12048076 1.11872954 1.68257077
C  -4.07897837 -0.55311101 0.88353406
H  -4.24951478 -1.19997969 0.02931731
H  -4.59633615 -0.80187842 1.80160034
