program: Gaussian 16
title: Title CardRequired
version: ES64L-G16RevC.01
basis: 6-311++G(2d,2p)
frameworkgroup: C1[X(C10H12O)]
method: RPBE1PBE
operation: FOpt
keyword: #
keyword: opt
keyword: 6-311++g(2d,2p)
keyword: geom=connectivity
keyword: pbe1pbe
title: # opt 6-311++g(2d,2p) geom=connectivity pbe1pbe
title: Title Card Required
nucrepener: 562.3939688097
converged: YES YES YES YES
title: Mulliken charges:
elementType: C C C C C C O H H H H C H H H C H H C H C H H
charge: 1.270385 -0.312806 -0.254301 -0.178929 0.036208 -0.352301 -0.392695 0.096941 0.105865 0.117608 0.127955 -0.038239 0.084904 0.114054 0.083275 -0.587925 0.104523 0.082179 0.169699 0.113308 -0.550994 0.082203 0.079086
chargesum: -0.00000
charge: 0.940153 -0.256467 -0.301604 -0.150881 -0.059734 -0.607801 -0.372143 0.092098 0.113635 0.100457 0.121492 -0.042898 0.089113 0.121932 0.089197 0.067785 0.091694 0.066180 0.105480 0.115376 -0.468278 0.079659 0.065556
dipole: 0.4621 -1.0287 0.1413
dipole: 1.1365
quadrupole: -62.2482 -61.4792 -67.9629
quadrupole: -4.5411 -0.5375 -0.6087
quadrupole: 1.6486 2.4176 -4.0662 -4.5411 -0.5375 -0.6087
hfenergy: -463.0604875 hartree
pointgroup: C01 [X(C10H12O1)]
dipole: 0.1872413 -0.4047049 0.0330487 debye
InChI: InChI=1S/C10H12O/c1-3-4-9-5-7-10(11-2)8-6-9/h3,5-8H,1,4H2,2H3
charge 0 multiplicity 1
23 atoms
C  -1.00810848 0.49777841 0.22799876
C  -0.1881775 1.61759968 0.09452251
C  1.18442793 1.49945239 -0.01574422
C  1.78028215 0.24066456 0.00298052
C  0.98045709 -0.89045729 0.13080482
C  -0.39786747 -0.74955328 0.23960442
O  3.13176576 0.2185066 -0.11195511
H  -0.63503726 2.60568321 0.07710402
H  1.41419656 -1.88045341 0.14450458
H  -1.01043775 -1.63945753 0.33033346
H  1.81617684 2.37219007 -0.1201374
C  3.76777519 -1.03743136 -0.09857203
H  3.4378568 -1.66333692 -0.93332238
H  4.83220048 -0.83885314 -0.2000258
H  3.58922706 -1.56776624 0.84178837
C  -2.50534726 0.63717296 0.37402091
H  -2.77414464 1.68099027 0.18302829
H  -2.80447427 0.42483952 1.40542776
C  -3.28060869 -0.24645292 -0.55218508
H  -3.07884596 -0.11478056 -1.61244707
C  -4.16431729 -1.15844823 -0.16879196
H  -4.69900709 -1.76696353 -0.8873853
H  -4.38597356 -1.32326578 0.88046227
