program: Gaussian 16
title: Title Card Required
version: ES64L-G16RevC.01
basis: 6-311++G(2d,2p)
frameworkgroup: C1[X(C9H8O)]
method: RPBE1PBE
operation: FOpt
keyword: #
keyword: opt
keyword: 6-311++g(2d,2p)
keyword: geom=connectivity
keyword: pbe1pbe
title: # opt 6-311++g(2d,2p) geom=connectivity pbe1pbe
nucrepener: 443.9024347322
converged: YES YES YES YES
title: Mulliken charges:
elementType: C C C C C C C H H H H H H C H C H O
charge: 1.064798 -1.146300 -0.279779 -0.234746 -0.322435 0.381577 0.199749 0.031830 0.112060 0.089482 0.031286 0.131366 0.109640 -0.107597 0.123276 0.112175 0.087512 -0.383896
chargesum: -0.00000
charge: 0.968151 -1.170770 -0.273763 -0.254908 -0.322584 0.364046 0.419314 0.029514 0.117214 0.095103 0.010366 0.132525 0.110620 -0.166883 0.104815 0.151047 0.062169 -0.375976
dipole: 4.6521 -1.1355 0.0009
dipole: 4.7887
quadrupole: -73.0096 -51.3032 -62.4148
quadrupole: 5.0066 -0.0054 -0.0017
quadrupole: -10.7671 10.9393 -0.1722 5.0066 -0.0054 -0.0017
hfenergy: -422.5965055 hartree
pointgroup: C01 [X(C9H8O1)]
dipole: -1.833529 -0.4332182 -0.0003602 debye
InChI: InChI=1S/C9H8O/c10-8-4-7-9-5-2-1-3-6-9/h1-8H
charge 0 multiplicity 1
18 atoms
C  -0.47970189 -0.23924929 -0.00034033
C  -0.92931937 1.08623746 -0.00025988
C  -2.28202405 1.37034771 0.00000975
C  -3.21592789 0.33923956 0.00020667
C  -2.78645951 -0.97954661 0.00009548
C  -1.43036996 -1.26391336 -0.00020107
C  0.93186861 -0.59338833 -0.00056068
H  -0.21449489 1.89908074 -0.00047192
H  -3.50746762 -1.78722666 0.00022327
H  -1.09483139 -2.29471121 -0.00030941
H  1.13954063 -1.66205929 -0.00127139
H  -2.61448486 2.40082969 0.00004626
H  -4.27458807 0.56665455 0.00041876
C  1.99094401 0.22934201 0.0000818
H  1.90648235 1.30961132 0.00090423
C  3.34204476 -0.31856475 -0.00026094
H  3.39409881 -1.42829519 -0.00099648
O  4.35155233 0.34614567 0.00025588
