program: Gaussian 16
title: Title Card Required
version: ES64L-G16RevC.01
basis: 6-311++G(2d,2p)
frameworkgroup: C1[X(C9H8O2)]
method: RPBE1PBE
operation: FOpt
keyword: #
keyword: opt
keyword: 6-311++g(2d,2p)
keyword: geom=connectivity
keyword: pbe1pbe
title: # opt 6-311++g(2d,2p) geom=connectivity pbe1pbe
nucrepener: 574.4414798482
converged: YES YES YES YES
title: Mulliken charges:
elementType: C C C C C C H H H H C O O C H H C H H
charge: -0.170309 -0.036883 1.517251 -0.872419 -0.389182 -0.131675 0.108832 0.099166 0.129925 0.119895 0.467266 -0.448973 -0.424203 -0.262411 0.101869 0.064142 -0.073138 0.116810 0.084037
chargesum: -0.00000
charge: -0.212561 -0.031290 1.374970 -0.823655 -0.327675 -0.093623 0.108883 0.097466 0.130592 0.118655 0.518996 -0.456808 -0.427157 -0.243470 0.102168 0.075308 -0.130669 0.120548 0.099322
dipole: -2.9287 2.8616 0.6505
dipole: 4.1460
quadrupole: -69.9091 -59.1908 -64.6558
quadrupole: 7.9588 0.9884 -0.8378
quadrupole: -5.3239 5.3945 -0.0706 7.9588 0.9884 -0.8378
hfenergy: -497.8152339 hartree
pointgroup: C01 [X(C9H8O2)]
dipole: -1.1334894 1.1460463 0.2500252 debye
InChI: InChI=1S/C9H8O2/c10-9-6-5-7-3-1-2-4-8(7)11-9/h1-4H,5-6H2
charge 0 multiplicity 1
19 atoms
C  -2.8766894 0.41570909 0.04921113
C  -1.80179653 1.28309467 -0.07507762
C  -0.49883792 0.80566622 -0.14792007
C  -0.30251989 -0.56894024 -0.08123349
C  -1.36219073 -1.45176351 0.04689472
C  -2.65347289 -0.95356382 0.10993199
H  -3.88444981 0.80676757 0.1025429
H  -1.97062125 2.3532567 -0.11704159
H  -1.15896015 -2.51358452 0.09151186
H  -3.48620746 -1.63796952 0.20973235
C  2.07848459 -0.39451484 0.04009797
O  0.95374987 -1.12963037 -0.18719234
O  3.14151246 -0.92229326 -0.09283397
C  0.70905201 1.67966186 -0.28014669
H  0.9709638 1.80300938 -1.33662096
H  0.50941779 2.6770016 0.11329077
C  1.86808305 1.03239392 0.46475587
H  2.81216548 1.55379327 0.3243136
H  1.65163496 1.01715382 1.53833056
