program: Gaussian 16
title: Title Card Required
version: ES64L-G16RevC.01
basis: 6-311++G(2d,2p)
frameworkgroup: C1[X(C9H10O4)]
method: RPBE1PBE
operation: Freq
keyword: #
keyword: freq=(raman,internal)
keyword: 6-311++g(2d,2p)
keyword: geom=connectivity
keyword: pbe1pbe
title: # freq=(raman,internal) 6-311++g(2d,2p) geom=connectivity pbe1pbe
nucrepener: 793.0099311725
converged: YES YES YES YES
title: Mulliken charges:
elementType: C C C C C C C C O O O H H H H H H H O C H H H
charge: 0.659340 -0.366418 0.314847 0.127318 0.034228 -0.306501 0.241427 -0.046737 -0.410246 -0.522538 -0.455574 0.116062 0.048928 0.088611 0.103349 0.103333 0.121638 0.301318 -0.420072 -0.041277 0.127267 0.090848 0.090846
chargesum: -0.00000
title: Mulliken charges with hydrogens summed into heavy atoms:
elementType: C C C C C C C C O O O O C
charge: 0.659340 -0.250356 0.314847 0.127318 0.034228 -0.257573 0.330038 0.281584 -0.410246 -0.522538 -0.154256 -0.420072 0.267685
1716.lowfreq: -0.0004 0.0004 0.0008 2.9348 5.3738 5.5374 61.6578 94.1626 101.8221
frequency: 61.6573 94.1625 101.8219 148.1301 157.0242 190.1744 193.5104 233.0546 253.5050 267.3629 304.4754 343.2666 367.7759 384.2248 416.2633 495.9323 528.5712 551.4816 599.5213 603.3235 635.8621 746.0619 776.2226 826.7710 855.5668 874.0116 952.8908 1015.0656 1025.4774 1098.2005 1167.8422 1174.1646 1176.2010 1178.0497 1208.1071 1218.8712 1248.9811 1297.0844 1318.7703 1379.1975 1411.4223 1453.1233 1464.8518 1485.5121 1490.5263 1493.2105 1502.1913 1505.5233 1509.2407 1568.0046 1648.0320 1676.9474 1785.7910 2906.3218 3029.7805 3044.1139 3093.3638 3113.0102 3166.1829 3170.8626 3215.3615 3234.5290 3812.8590
redmass: 2.9940 4.1335 5.7883 5.6389 4.5097 3.5059 1.6771 1.3569 1.4137 4.6715 2.4276 5.1688 4.4387 4.5585 6.1627 1.1207 6.6960 6.5839 4.3682 4.0438 4.4579 5.0959 4.4627 4.9197 1.5188 1.4279 4.9924 4.1783 1.8109 4.2470 2.1786 1.2810 1.2759 2.8076 1.3270 1.5052 1.8407 3.4279 2.1847 2.7611 1.6684 2.7553 1.3841 1.3318 1.0423 1.0434 1.1969 1.0741 2.1188 5.5978 7.0424 6.5705 10.3007 1.0832 1.0348 1.0332 1.1057 1.1064 1.0994 1.1016 1.0895 1.0906 1.0647
irintensity: 7.2119 1.1486 1.2078 7.0157 7.6736 2.8059 0.3860 3.4987 0.0490 8.0840 1.1164 1.3218 1.0225 0.0127 0.8645 89.4193 5.9670 0.9992 2.0352 4.4254 18.6236 78.4463 3.8124 2.5481 18.5735 17.0613 5.9070 1.6884 1.3779 1.2894 220.9489 0.7651 0.4023 171.9639 2.3458 5.7239 239.8447 107.8986 103.9180 216.3878 149.0923 61.8214 57.7374 1.1058 10.7723 10.3915 9.1953 30.0586 207.8382 131.6102 72.9803 150.6324 343.8110 112.4801 48.0717 38.7324 29.2247 20.7944 15.5833 13.8007 2.5164 3.4168 144.1836
temp: 298.150 k
press: 1.00000 atm
elementType: 6 6 6 6 6 6 6 6 8 8 8 1 1 1 1 1 1 1 8 6 1 1 1
symmnumber: 1
zpe: 474016.7 jmol-1
zpe.correction: 0.180543 hartree
zpe.thermalcorrener: 0.193088 hartree
zpe.thermalcorrenthalpy: 0.194033 hartree
zpe.thermalcorrgfe: 0.141849 hartree
zpe.sumelectzpe: -649.131954 hartree
zpe.sumelectthermal: -649.119409 hartree
zpe.sumelectthermalent: -649.118465 hartree
zpe.sumelectthermalfe: -649.170649 hartree
dipole: -0.8294 -1.8676 0.0009
dipole: 2.0435
quadrupole: -63.9384 -82.5460 -77.1776
quadrupole: -19.3394 0.0017 -0.0008
quadrupole: 10.6156 -7.9920 -2.6236 -19.3394 0.0017 -0.0008
hfenergy: -649.3124976 hartree
pointgroup: C01 [X(C9H10O4)]
dipole: -0.326329 -0.7347871 0.0003519 debye
dipolederiv: -0.0066773 -0.1807691 -0.0000048 -0.3522082 -1.0583127 -0.0000062 -0.0000108 -0.0000284 -0.0580797 -0.2019386 -0.1131059 -0.0000097 0.2511327 0.0343 -0.0000054 0.000032 -0.0000212 -0.1296978 0.736829 -1.0127359 -0.000074 -0.856515 0.5795577 -0.0000059 -0.0001847 0.000151 0.0472362 -0.2116632 0.4716036 0.0000148 0.4263651 1.5967764 0.0000595 -0.0000129 0.0000723 0.0635983 1.6605838 0.4233865 -0.000053 0.3402745 -0.2356049 -0.0000312 -0.0000833 -0.0000255 0.0458738 -0.1608835 0.2945463 0.0000029 -0.1346676 0.1354068 0.0000321 -0.0000003 -0.0000024 -0.1532481 1.1365143 0.6677598 -0.000059 0.5004968 1.8435389 0.0000113 -0.0000666 -0.0000036 0.1531339 0.9867977 -0.2386622 0.000128 0.1196386 0.1908922 0.0000112 0.0002193 -0.0000591 0.2798721 -1.0760449 -0.8375969 0.0000313 -0.3469858 -0.9798935 0.0000081 0.0000575 0.0000537 -0.3331086 -1.4992217 0.6593136 -0.0001279 0.6308086 -0.890477 -0.0000308 -0.0000748 -0.0001681 -0.2461287 -0.276897 -0.2528243 -0.0000074 -0.2751218 -1.730944 -0.00004 -0.0000051 -0.0000598 -0.2961323 0.0109795 0.0178479 0.0000102 -0.0299911 0.1345521 -0.0000051 0.0000182 -0.0000107 0.1408399 0.0391577 0.0529944 0.0000084 0.1042174 0.0310134 -0.000011 0.0000077 -0.0000157 0.1425705 -0.1539855 0.1969344 0.000022 0.1090651 -0.0886129 -0.0000132 0.0000145 -0.0000086 0.0668801 -0.0259469 0.0399866 -0.0127974 -0.1020865 0.0426616 0.0814637 0.0521565 0.0579799 -0.0604606 -0.0258503 0.0400337 0.0128954 -0.1020295 0.042645 -0.0815251 -0.0520919 -0.057943 -0.0604555 0.000361 0.0520594 -0.0000279 0.1133892 -0.0642824 0.0000612 -0.0000363 0.0000479 0.0976976 0.2754106 -0.0493494 0.0000073 0.0263906 0.4333396 0.0000104 -0.0000081 0.0000307 0.2949422 -1.9456029 0.0139486 0.0000594 -0.0462769 -0.397798 0.0000041 0.0000931 0.0000064 -0.2392745 0.803972 -0.1563928 -0.0000207 -0.5232051 0.3857484 0.0000198 -0.000031 0.0000067 0.3020337 -0.0974414 -0.0330074 0.0000015 -0.0967265 0.0326005 -0.0000018 -0.0000003 -0.0000034 0.0950457 0.0157706 -0.0279833 -0.0531216 0.1220181 -0.0185501 -0.0722955 0.018481 -0.0890855 -0.076576 0.015777 -0.0279875 0.053122 0.1220172 -0.0185572 0.07229 -0.0184737 0.0890862 -0.0765625 unknown
polarizability: 159.3525806|2.6465355|156.5613469|-0.0013564|0.000652|73.2863894 unknown
InChI: InChI=1S/C9H10O4/c1-12-7-3-6(5-10)4-8(13-2)9(7)11/h3-5,11H,1-2H3
charge 0 multiplicity 1
23 atoms
C  0.33054 1.464239 -0.000009
C  1.321001 0.484317 -0.00011
C  0.940668 -0.841442 -0.000138
C  -0.413942 -1.201652 -0.00008
C  -1.402616 -0.213631 0.000009
C  -1.019212 1.120831 0.000049
C  0.70354 2.88192 0.000016
C  3.167911 -1.650043 0.000367
O  1.836773 3.302283 -0.000081
O  1.778911 -1.912303 -0.000262
O  -0.77267 -2.496499 -0.00011
H  2.356127 0.795246 -0.000185
H  -1.760851 1.908696 0.000135
H  -0.156684 3.58378 0.000077
H  3.461512 -1.091761 -0.891829
H  3.460654 -1.091539 0.892704
H  3.659664 -2.619405 0.00071
H  0.03899 -3.017005 -0.000114
O  -2.675639 -0.6633 0.000068
C  -3.702174 0.301954 0.000105
H  -4.63643 -0.253911 0.000092
H  -3.658137 0.932715 0.892936
H  -3.658144 0.932775 -0.892684
