program: Gaussian 16
title: Title Card Required
version: ES64L-G16RevC.01
basis: 6-311++G(2d,2p)
frameworkgroup: C1[X(C10H12O2)]
method: RPBE1PBE
operation: Freq
keyword: #
keyword: freq=(raman,internal)
keyword: 6-311++g(2d,2p)
keyword: geom=connectivity
keyword: pbe1pbe
title: # freq=(raman,internal) 6-311++g(2d,2p) geom=connectivity pbe1pbe
nucrepener: 674.3600929094
converged: YES YES YES YES
title: Mulliken charges:
elementType: C C C C C C C O O H H H H H H H C H H C H C H H
charge: 0.820075 0.040566 -0.015811 -0.199444 -0.180903 -0.484601 -0.036854 -0.502152 -0.433841 0.059828 0.129215 0.083988 0.099504 0.097949 0.117685 0.288990 0.080442 0.070086 0.097905 0.073588 0.116258 -0.468627 0.066272 0.079881
chargesum: -0.00000
title: Mulliken charges with hydrogens summed into heavy atoms:
elementType: C C C C C C C O O C C C
charge: 0.820075 0.100395 -0.015811 -0.199444 -0.051688 -0.400613 0.278284 -0.502152 -0.144851 0.248433 0.189846 -0.322474
1716.lowfreq: -3.7994 -2.6754 0.0003 0.0006 0.0007 3.4075 29.9245 72.6810 83.9287
frequency: 29.9221 72.6806 83.9286 117.4159 179.2695 199.1838 234.8242 277.9077 301.0477 362.1006 376.0686 402.5182 445.1976 469.9854 493.9598 549.8207 568.1695 611.6199 659.7220 742.6470 766.0224 818.4333 837.4436 875.2706 911.4556 946.7164 951.0016 958.9095 972.1086 1034.9468 1085.7328 1126.6663 1146.8469 1175.6163 1185.4946 1211.6627 1234.6206 1239.9653 1280.5068 1298.3366 1320.7371 1325.0460 1346.0286 1427.2561 1447.9395 1469.1487 1473.5032 1489.7334 1492.1259 1506.8484 1566.3288 1670.4674 1678.8981 1715.7056 3036.3882 3039.7830 3079.6216 3101.8226 3145.6266 3155.9109 3164.5873 3190.1860 3211.2985 3216.1073 3237.0534 3833.2969
redmass: 3.1567 3.5190 3.2288 2.7376 3.0645 2.3365 1.6746 2.5396 3.6692 3.9118 3.3765 2.6866 1.3090 2.0518 2.9586 3.6486 4.6795 2.6391 2.7996 3.2736 3.1789 2.8416 1.7999 1.5845 1.5796 1.4022 1.3709 2.0661 2.9097 1.1302 3.8473 1.6400 1.4002 1.2778 2.0263 1.5598 1.4455 1.3154 2.5463 1.6499 2.3717 1.8202 1.5419 2.6277 1.1812 1.3801 1.2567 1.0432 1.8339 1.1441 3.7002 6.5632 6.6818 4.8190 1.0337 1.0596 1.1013 1.1059 1.0600 1.0907 1.1007 1.0889 1.0897 1.0937 1.1155 1.0649
irintensity: 0.7113 0.1458 3.4174 0.4054 0.3920 0.7808 0.5036 1.1467 3.1179 2.9356 0.2503 1.8622 80.7582 14.6538 1.1551 1.0752 9.8573 12.3157 10.3001 3.4687 17.8942 33.8512 19.9983 13.2190 11.8831 37.4805 2.4901 3.5981 11.9620 16.6720 30.5460 4.5302 15.1657 0.4114 47.9971 8.8756 58.7521 9.3907 151.1678 31.3285 131.8100 64.9142 10.8210 37.3242 2.6014 5.2875 32.5282 10.6365 6.4958 58.3995 241.4911 12.9460 17.9979 18.7692 41.2306 22.3543 9.4807 25.0730 11.4795 4.2716 16.6512 8.8288 3.9691 4.0907 12.0275 105.3433
temp: 298.150 k
press: 1.00000 atm
elementType: 6 6 6 6 6 6 6 8 8 1 1 1 1 1 1 1 6 1 1 6 1 6 1 1
symmnumber: 1
zpe: 523828.0 jmol-1
zpe.correction: 0.199516 hartree
zpe.thermalcorrener: 0.211294 hartree
zpe.thermalcorrenthalpy: 0.212238 hartree
zpe.thermalcorrgfe: 0.160997 hartree
zpe.sumelectzpe: -538.038989 hartree
zpe.sumelectthermal: -538.027210 hartree
zpe.sumelectthermalent: -538.026266 hartree
zpe.sumelectthermalfe: -538.077507 hartree
dipole: 0.8539 2.2993 -0.2565
dipole: 2.4661
quadrupole: -74.3494 -62.9386 -73.2108
quadrupole: -4.8953 -0.3355 -0.4480
quadrupole: -4.1831 7.2276 -3.0445 -4.8953 -0.3355 -0.4480
hfenergy: -538.2385041 hartree
pointgroup: C01 [X(C10H12O2)]
dipole: -0.3359658 -0.9045996 -0.1009069 debye
dipolederiv: 0.1803225 -0.0035204 0.0411639 0.0964819 -0.097262 0.0307215 0.1421381 0.0593273 -0.1007786 -0.181673 0.1117432 0.0085151 -0.0590802 -0.0951253 0.0010453 -0.0054477 0.0088193 -0.1475629 0.2107548 -0.5484017 -0.0126403 -0.7837309 1.1242673 -0.0290225 -0.0171347 -0.0234874 0.0530949 1.5311349 -0.0998251 0.1527273 0.0729827 -0.1745639 0.0012417 0.1784814 -0.0203708 0.0681612 -0.1230098 -0.1189633 0.0081833 0.2129386 0.0728719 0.0365559 0.0095755 -0.0042847 -0.1627248 -0.0868872 0.1018907 0.0177786 -0.0766767 0.0376209 -0.015761 0.0204495 0.0233172 -0.1482929 0.2273848 0.3234731 0.0127957 -0.0215164 0.8943238 0.0311224 -0.0091178 0.065752 0.2871465 -0.6521211 0.3207061 -0.0245168 0.4369607 -1.6911835 -0.0291846 -0.0241529 -0.0212376 -0.2464545 -1.6610409 0.055708 -0.1289497 0.1169989 -0.2478058 0.0144918 -0.1530135 0.0096172 -0.3399158 0.1081105 -0.0737433 -0.0199424 -0.0620604 -0.0174277 -0.0107294 -0.0251173 -0.0116289 0.1216512 0.0246807 -0.0621282 -0.0138775 -0.0649428 -0.011022 -0.0143164 -0.0208926 -0.0176912 0.1430754 0.0242345 0.0955833 -0.0103009 0.0746512 -0.0432387 0.0006498 -0.0085214 0.0031569 0.1309706 0.0003246 -0.1232625 0.0801099 0.0213452 -0.0063123 -0.0288548 0.08555 0.0257631 -0.0507257 0.0337217 -0.1081898 -0.0756026 0.0215898 -0.0062238 0.0380187 -0.0644313 -0.0501203 -0.0871438 -0.020644 0.1203815 -0.0076319 0.0616955 -0.0527378 0.0002035 -0.0104768 0.0075109 0.0952349 0.4026981 -0.001093 0.0099218 -0.045533 0.2625211 -0.0046201 0.0093715 -0.0015107 0.2983712 0.1422352 -0.0773915 0.0011819 -0.1454172 0.0700255 0.027731 -0.030996 0.0083335 0.1095903 -0.0890138 -0.0191445 -0.0408848 -0.0447174 0.0491639 -0.0716081 -0.0543499 -0.0093593 -0.0892714 0.0035599 -0.013082 0.0096483 0.0386465 -0.1176355 0.0110214 0.0719307 0.0070335 0.0601401 -0.0524633 0.2267183 -0.0286178 0.3710682 0.0924375 -0.0157063 -0.1430372 -0.038525 0.0984483 0.1079828 -0.0524772 -0.0241362 -0.0662863 0.0508494 -0.0175657 0.0036539 -0.0179154 -0.0882375 -0.3179844 0.0651217 0.0004314 0.0046222 -0.2190343 0.001602 0.0155871 -0.0301261 0.101184 0.1135913 -0.0388024 0.0119625 -0.0436411 0.0805295 0.0082048 -0.0358251 -0.042063 -0.0922006 0.0741011 -0.0813011 0.0326809 -0.1163789 0.0449617 0.0347593 0.0657765 0.0696896 -0.0137602 unknown
polarizability: 159.7797007|7.5077524|143.8831632|5.063915|1.7996197|84.6035046 unknown
InChI: InChI=1S/C10H12O2/c1-3-4-8-5-6-9(11)10(7-8)12-2/h3,5-7,11H,1,4H2,2H3
charge 0 multiplicity 1
24 atoms
C  -0.906771 0.834231 -0.230256
C  -0.21392 -0.37945 -0.200624
C  1.1593 -0.39948 -0.044481
C  1.873853 0.798864 0.090218
C  1.192454 1.998088 0.066908
C  -0.189904 2.012191 -0.091524
C  1.297655 -2.766701 -0.123845
O  1.93924 -1.517025 -0.000968
O  3.2193 0.775971 0.246331
H  -0.768361 -1.304253 -0.293695
H  1.753835 2.917113 0.175692
H  -0.711358 2.961997 -0.108527
H  0.579666 -2.923302 0.685681
H  0.784327 -2.853769 -1.085366
H  2.080353 -3.519036 -0.063222
H  3.495422 -0.146331 0.238884
C  -2.404584 0.844067 -0.42654
H  -2.653065 0.542961 -1.449329
H  -2.758056 1.87317 -0.31052
C  -3.136149 -0.039605 0.534807
H  -2.980379 0.176086 1.589061
C  -3.929953 -1.044829 0.188746
H  -4.105381 -1.292109 -0.853124
H  -4.437219 -1.648342 0.931122
