program: Orca
programVersion: 5.0.4
elementType: C C H H C C C H H H H C H H H C H H H H H H O H H O H H
charge: 1
multiplicity: 1
keywords: wB97X-D3BJ Opt Freq def2-TZVPP def2/J RIJCOSX VeryTightSCF
keywords: PAL8 defgrid3 VeryTightOpt
frequency: 0.00 0.00 0.00 0.00 0.00 0.00 17.58 44.79 67.64 83.58 96.54 116.54 132.90 159.35 223.48 241.92 244.84 258.50 281.09 328.37 377.67 385.07 404.26 477.38 498.32 555.73 719.92 736.79 766.59 849.17 905.65 939.13 959.88 986.85 1020.70 1042.65 1077.27 1088.74 1099.61 1132.65 1168.99 1181.53 1223.67 1269.56 1275.24 1319.38 1334.50 1345.86 1348.66 1372.52 1391.28 1428.74 1433.68 1439.08 1447.24 1483.59 1497.31 1497.42 1500.14 1503.61 1508.55 1511.68 1521.70 1638.28 1700.80 2648.61 3040.20 3047.03 3052.80 3060.24 3065.48 3068.88 3070.03 3082.83 3098.06 3114.42 3129.52 3135.48 3143.29 3150.17 3160.96 3808.42 3838.23 3925.17
frequency: 17.58 44.79 67.64 83.58 96.54 116.54 132.90 159.35 223.48 241.92 244.84 258.50 281.09 328.37 377.67 385.07 404.26 477.38 498.32 555.73 719.92 736.79 766.59 849.17 905.65 939.13 959.88 986.85 1020.70 1042.65 1077.27 1088.74 1099.61 1132.65 1168.99 1181.53 1223.67 1269.56 1275.24 1319.38 1334.50 1345.86 1348.66 1372.52 1391.28 1428.74 1433.68 1439.08 1447.24 1483.59 1497.31 1497.42 1500.14 1503.61 1508.55 1511.68 1521.70 1638.28 1700.80 2648.61 3040.20 3047.03 3052.80 3060.24 3065.48 3068.88 3070.03 3082.83 3098.06 3114.42 3129.52 3135.48 3143.29 3150.17 3160.96 3808.42 3838.23 3925.17
formula: C7H19O2
InChI: InChI=1/C7H17O.H2O/c1-3-4-5-6-7(2)8;/h7H,3-6,8H2,1-2H3;1H2
28 atoms
C  -7.463808 0.605663 0.243192
C  -5.948244 0.54855 0.424428
H  -7.96328 0.035402 1.033592
H  -7.735028 0.121781 -0.701159
C  -7.98757 2.039632 0.25003
C  -5.349592 -0.836301 0.339423
C  -3.850792 -0.906747 0.504755
H  -5.694269 -1.362287 -0.550881
H  -5.647372 1.016143 1.367927
H  -5.461892 1.127367 -0.36658
H  -7.703497 2.528363 1.189462
C  -9.502065 2.117627 0.075066
H  -7.499494 2.607323 -0.549748
H  -9.988485 1.548912 0.875146
H  -9.781147 1.627799 -0.863522
C  -10.015695 3.554242 0.078788
H  -9.772766 4.055859 1.018976
H  -11.098751 3.587779 -0.047519
H  -9.566972 4.132405 -0.732571
H  -3.530543 -0.410271 1.422832
H  -3.38536 -0.390794 -0.33633
H  -3.484751 -1.935886 0.498887
O  -6.000924 -1.658626 1.455406
H  -5.945887 -1.226672 2.388053
H  -5.666747 -2.565231 1.479426
O  -5.961379 -0.558876 3.722876
H  -5.303557 -0.661916 4.416761
H  -6.789054 -0.306532 4.143615
totalener: -428.72258073 hartree
nucrepener: 496.72293278 hartree
electener: -925.44551351 hartree
oneelecener: -1553.30242182 hartree
twoeener: 627.85690831 hartree
kineticenergy: 426.65949736 hartree
exchangeener: -39.415376176622 hartree
correlationener: -3.079079342314 hartree
xcener: -42.494455518936 hartree
dispersion: -0.036744671 hartree
temp: 298.15 k
press: 1.00 atm
thermalcorrenthalpy: 0.00094421 hartree
totalenthalpy: -428.48389011 hartree
vibrat: 0.01609252 hartree
rotat: 0.01458538 hartree
transl: 0.01929865 hartree
total: 0.04997655 hartree
totalentropycorr: -0.04997655 hartree
gibbsenthalpy: -428.53386666 hartree
gibbsminuselec: 0.22545874 hartree
dispersion: -0.036603885 hartree
dispersion: -0.036539986 hartree
dispersion: -0.036675565 hartree
dispersion: -0.036583141 hartree
dispersion: -0.036458957 hartree
dispersion: -0.036522144 hartree
dispersion: -0.036513901 hartree
dispersion: -0.036364640 hartree
dispersion: -0.036481972 hartree
dispersion: -0.036494520 hartree
dispersion: -0.036478608 hartree
dispersion: -0.036480975 hartree
dispersion: -0.036494375 hartree
dispersion: -0.036388197 hartree
dispersion: -0.036508732 hartree
dispersion: -0.036553677 hartree
dispersion: -0.036657763 hartree
dispersion: -0.036676103 hartree
dispersion: -0.036679084 hartree
dispersion: -0.036671966 hartree
dispersion: -0.036663842 hartree
dispersion: -0.036652304 hartree
dispersion: -0.036644933 hartree
dispersion: -0.036638522 hartree
dispersion: -0.036636775 hartree
dispersion: -0.036635896 hartree
dispersion: -0.036635444 hartree
chargesum: 1.0000000
charge: -0.106723 -0.182184 0.059259 0.083545 -0.125948 0.057571 -0.244745 0.156335 0.089778 0.116049 0.062261 -0.097392 0.077429 0.058208 0.070568 -0.260170 0.076967 0.100461 0.084064 0.103508 0.124500 0.106696 -0.092504 0.261205 0.253601 -0.378708 0.270774 0.275596
charge: -0.027574 -0.023783 0.012920 0.026152 -0.029746 -0.046604 0.026837 0.037859 0.027452 0.046882 0.018947 -0.039800 0.023419 0.014621 0.018516 0.008274 0.010537 0.014385 0.012717 0.024013 0.041983 0.021202 0.664064 -0.145726 -0.035222 0.461738 -0.083872 -0.080193
qa: -0.1067 -0.1822 0.0593 0.0835 -0.1259 0.0576 -0.2447 0.1563 0.0898 0.1160 0.0623 -0.0974 0.0774 0.0582 0.0706 -0.2602 0.0770 0.1005 0.0841 0.1035 0.1245 0.1067 -0.0925 0.2612 0.2536 -0.3787 0.2708 0.2756
va: 3.8152 3.8060 1.0229 1.0167 3.8708 3.7582 3.9689 0.9868 1.0282 1.0131 1.0099 3.8998 1.0097 1.0036 1.0043 3.9571 1.0018 1.0037 1.0022 1.0005 1.0060 1.0052 2.4626 1.0835 0.9995 2.1806 0.9894 0.9864
dispersion: -0.036634845 hartree
energy: -428.772785986242 hartree
dipole: -1.71185 3.83359 2.12174 4.24820 -6.80937 -2.56117 -1.27154 3.20533 1.93379
magnitude: 3.84719 au
magnitude: 9.77879 debye
quadrupole: 1057.23606 -1088.89811 -31.66204 812.75820 -842.04266 -29.28446 451.50230 -475.37293 -23.87063 -779.12161 769.24780 -9.87381 217.50769 -214.44602 3.06166 -267.74490 261.86884 -5.87606
zeropoint: 0.26040360 hartree
thermalvibcorrection: 0.01140218 hartree
thermalrotcorrection: 0.00141627 hartree
thermaltrasncorrection: 0.00141627 hartree
thermaltotal: -428.49814767 hartree
thermalcorr: 0.01423472 hartree
nonthermalcorr: 0.26040360 hartree
totalcorr: 0.27463832 hartree
totalenthalpy: -428.49720346 hartree
vibrat: 0.02079974 hartree
rotat: 0.01457091 hartree
total: 0.05466930 hartree
