program: Orca
programVersion: 5.0.4
elementType: C C H H C C H C H H H H H H H H O H H
charge: 1
multiplicity: 1
keywords: wB97X-D3BJ Opt Freq def2-TZVPP def2/J RIJCOSX VeryTightSCF
keywords: PAL8 defgrid3 VeryTightOpt
frequency: 0.00 0.00 0.00 0.00 0.00 0.00 36.99 60.89 90.02 130.73 143.98 176.98 206.03 263.11 280.42 308.30 321.41 402.77 438.28 610.54 772.91 839.33 964.02 973.68 986.54 1025.42 1044.51 1129.73 1141.71 1211.74 1239.09 1284.02 1319.16 1351.74 1396.77 1434.68 1434.92 1464.84 1472.94 1504.48 1507.45 1509.62 1576.20 1658.53 2970.49 3037.84 3080.97 3129.68 3137.77 3152.67 3162.06 3166.44 3172.82 3188.25 3249.62 3846.67 3933.01
frequency: 36.99 60.89 90.02 130.73 143.98 176.98 206.03 263.11 280.42 308.30 321.41 402.77 438.28 610.54 772.91 839.33 964.02 973.68 986.54 1025.42 1044.51 1129.73 1141.71 1211.74 1239.09 1284.02 1319.16 1351.74 1396.77 1434.68 1434.92 1464.84 1472.94 1504.48 1507.45 1509.62 1576.20 1658.53 2970.49 3037.84 3080.97 3129.68 3137.77 3152.67 3162.06 3166.44 3172.82 3188.25 3249.62 3846.67 3933.01
formula: C5H13O
InChI: InChI=1/C5H11.H2O/c1-3-5-4-2;/h3H,4-5H2,1-2H3;1H2
19 atoms
C  -6.935218 0.929547 -0.373706
C  -5.513284 1.462449 0.219401
H  -7.153156 -0.13183 -0.149498
H  -6.802464 0.951475 -1.453753
C  -8.078813 1.766339 0.182211
C  -5.409114 0.123755 0.658693
H  -5.86886 -0.116999 1.618813
C  -4.688343 -0.928841 -0.076581
H  -5.1814 -1.898539 -0.015158
H  -5.712335 2.21583 0.972418
H  -4.858741 1.782693 -0.583466
H  -8.133791 1.666181 1.266554
H  -9.020624 1.420602 -0.245021
H  -7.941743 2.816629 -0.074107
H  -4.464079 -0.654416 -1.106501
H  -3.733626 -1.027669 0.461442
O  -7.178328 0.158005 3.228521
H  -6.937537 0.622631 4.034766
H  -7.862255 -0.46112 3.498224
totalener: -273.50513430 hartree
nucrepener: 247.13115351 hartree
electener: -520.63628781 hartree
oneelecener: -848.55700353 hartree
twoeener: 327.92071572 hartree
kineticenergy: 272.11516830 hartree
exchangeener: -25.501670205770 hartree
correlationener: -2.000425894122 hartree
xcener: -27.502096099891 hartree
dispersion: -0.022298997 hartree
temp: 298.15 k
press: 1.00 atm
thermalcorrenthalpy: 0.00094421 hartree
totalenthalpy: -273.34388471 hartree
vibrat: 0.01177328 hartree
rotat: 0.01340738 hartree
transl: 0.01870871 hartree
total: 0.04388937 hartree
totalentropycorr: -0.04388937 hartree
gibbsenthalpy: -273.38777408 hartree
gibbsminuselec: 0.13965921 hartree
dispersion: -0.022726870 hartree
dispersion: -0.022909451 hartree
dispersion: -0.022713250 hartree
dispersion: -0.022830519 hartree
dispersion: -0.022831370 hartree
dispersion: -0.022823253 hartree
dispersion: -0.022809130 hartree
dispersion: -0.022801233 hartree
dispersion: -0.022804700 hartree
dispersion: -0.022830657 hartree
dispersion: -0.022816917 hartree
dispersion: -0.022766878 hartree
dispersion: -0.022848359 hartree
dispersion: -0.022860000 hartree
dispersion: -0.022870357 hartree
dispersion: -0.022842525 hartree
dispersion: -0.022828104 hartree
dispersion: -0.022769081 hartree
dispersion: -0.022783562 hartree
dispersion: -0.022783523 hartree
dispersion: -0.022798218 hartree
dispersion: -0.022799252 hartree
dispersion: -0.022800251 hartree
dispersion: -0.022801928 hartree
chargesum: 1.0000000
charge: -0.078472 -0.105574 0.121572 0.140270 -0.245432 0.065097 0.217362 -0.207542 0.137391 0.141368 0.148844 0.097283 0.122663 0.118235 0.118133 0.153184 -0.440289 0.248797 0.247111
charge: 0.086665 0.078088 0.060021 0.044567 0.040565 0.198219 0.035536 0.062287 0.042337 0.048542 0.043493 0.020193 0.029894 0.026533 0.039488 0.068428 0.300717 -0.112614 -0.112958
qa: -0.0785 -0.1056 0.1216 0.1403 -0.2454 0.0651 0.2174 -0.2075 0.1374 0.1414 0.1488 0.0973 0.1227 0.1182 0.1181 0.1532 -0.4403 0.2488 0.2471
va: 3.8839 3.8871 0.9994 1.0062 3.9261 3.4854 1.0386 3.9555 1.0009 1.0163 1.0081 1.0293 0.9996 0.9974 1.0039 0.9929 2.0695 1.0079 1.0085
dispersion: -0.022802276 hartree
energy: -273.531924749316 hartree
dipole: -0.94485 1.37529 0.43044 -0.11083 -0.26905 -0.37988 -1.44940 1.51361 0.06421
magnitude: 0.57767 au
magnitude: 1.46833 debye
quadrupole: 294.61393 -314.65703 -20.04310 191.55955 -213.87258 -22.31303 346.89865 -362.28236 -15.38370 -130.92741 129.46291 -1.46450 -92.52575 88.86579 -3.65996 -43.07876 42.10694 -0.97181
zeropoint: 0.17301036 hartree
thermalvibcorrection: 0.00785933 hartree
thermalrotcorrection: 0.00141627 hartree
thermaltrasncorrection: 0.00141627 hartree
thermaltotal: -273.34822251 hartree
thermalcorr: 0.01069187 hartree
nonthermalcorr: 0.17301036 hartree
totalcorr: 0.18370224 hartree
totalenthalpy: -273.34727830 hartree
vibrat: 0.01421710 hartree
rotat: 0.01329605 hartree
total: 0.04622187 hartree
