program: Orca
programVersion: 5.0.4
elementType: C C H H C C H C H H H H H H H H
charge: 1
multiplicity: 1
keywords: wB97X-D3BJ Opt Freq def2-TZVPP def2/J RIJCOSX VeryTightSCF
keywords: PAL8 defgrid3 VeryTightOpt
frequency: 0.00 0.00 0.00 0.00 0.00 0.00 82.93 172.02 209.00 242.60 304.75 396.56 438.98 583.14 762.92 836.53 961.09 965.84 984.33 1022.47 1035.91 1095.18 1134.52 1208.23 1238.66 1275.78 1309.63 1342.82 1398.29 1432.50 1438.34 1459.87 1471.99 1497.10 1504.71 1506.85 1576.67 2972.07 3037.70 3079.60 3131.39 3150.42 3162.48 3166.22 3173.43 3177.50 3192.93 3254.42
frequency: 82.93 172.02 209.00 242.60 304.75 396.56 438.98 583.14 762.92 836.53 961.09 965.84 984.33 1022.47 1035.91 1095.18 1134.52 1208.23 1238.66 1275.78 1309.63 1342.82 1398.29 1432.50 1438.34 1459.87 1471.99 1497.10 1504.71 1506.85 1576.67 2972.07 3037.70 3079.60 3131.39 3150.42 3162.48 3166.22 3173.43 3177.50 3192.93 3254.42
formula: C5H11
InChI: InChI=1/C5H11/c1-3-5-4-2/h3H,4-5H2,1-2H3
16 atoms
C  -6.900736 0.9177 -0.441814
C  -5.507641 1.4068 0.267292
H  -7.083392 -0.173263 -0.410232
H  -6.733177 1.118252 -1.498627
C  -8.088929 1.617126 0.201904
C  -5.416543 0.029178 0.552317
H  -5.917547 -0.331908 1.448636
C  -4.636077 -0.937278 -0.239619
H  -5.121117 -1.909958 -0.316169
H  -5.752656 2.077959 1.081835
H  -4.822247 1.811999 -0.468217
H  -8.1685 1.366272 1.261082
H  -9.007819 1.298867 -0.290884
H  -7.993667 2.698234 0.106295
H  -4.351839 -0.549914 -1.217035
H  -3.715622 -1.087586 0.344246
totalener: -196.96382592 hartree
nucrepener: 177.22478821 hartree
electener: -374.18861413 hartree
oneelecener: -605.67631631 hartree
twoeener: 231.48770218 hartree
kineticenergy: 195.87109336 hartree
exchangeener: -19.363209622278 hartree
correlationener: -1.572477383798 hartree
xcener: -20.935687006076 hartree
dispersion: -0.019418623 hartree
temp: 298.15 k
press: 1.00 atm
thermalcorrenthalpy: 0.00094421 hartree
totalenthalpy: -196.82934555 hartree
vibrat: 0.00654316 hartree
rotat: 0.01231295 hartree
transl: 0.01838903 hartree
total: 0.03724515 hartree
totalentropycorr: -0.03724515 hartree
gibbsenthalpy: -196.86659071 hartree
gibbsminuselec: 0.11665384 hartree
dispersion: -0.019431318 hartree
dispersion: -0.019349970 hartree
dispersion: -0.019312936 hartree
dispersion: -0.019280519 hartree
dispersion: -0.019284329 hartree
dispersion: -0.019293567 hartree
dispersion: -0.019283951 hartree
dispersion: -0.019287084 hartree
dispersion: -0.019289150 hartree
dispersion: -0.019285770 hartree
dispersion: -0.019287699 hartree
dispersion: -0.019278999 hartree
dispersion: -0.019274250 hartree
dispersion: -0.019272512 hartree
dispersion: -0.019276682 hartree
dispersion: -0.019292751 hartree
dispersion: -0.019305603 hartree
dispersion: -0.019309948 hartree
dispersion: -0.019310045 hartree
dispersion: -0.019306767 hartree
dispersion: -0.019304867 hartree
dispersion: -0.019199243 hartree
dispersion: -0.019108960 hartree
dispersion: -0.019034879 hartree
dispersion: -0.019036141 hartree
dispersion: -0.019048407 hartree
dispersion: -0.018964785 hartree
dispersion: -0.018887902 hartree
dispersion: -0.018839014 hartree
dispersion: -0.018809452 hartree
dispersion: -0.018868929 hartree
dispersion: -0.019051420 hartree
dispersion: -0.019391566 hartree
dispersion: -0.019628712 hartree
dispersion: -0.019630295 hartree
dispersion: -0.019585973 hartree
dispersion: -0.019548741 hartree
dispersion: -0.019534522 hartree
dispersion: -0.019561573 hartree
dispersion: -0.019606488 hartree
dispersion: -0.019699708 hartree
dispersion: -0.019825233 hartree
dispersion: -0.019815082 hartree
dispersion: -0.019836697 hartree
dispersion: -0.019836540 hartree
dispersion: -0.019849777 hartree
dispersion: -0.019842497 hartree
dispersion: -0.019843370 hartree
dispersion: -0.019843556 hartree
dispersion: -0.019842944 hartree
dispersion: -0.019842233 hartree
dispersion: -0.019841632 hartree
dispersion: -0.019835100 hartree
dispersion: -0.019863519 hartree
dispersion: -0.019883770 hartree
dispersion: -0.019882884 hartree
dispersion: -0.019873692 hartree
dispersion: -0.019873396 hartree
dispersion: -0.019876221 hartree
dispersion: -0.019893422 hartree
dispersion: -0.020035798 hartree
dispersion: -0.020142889 hartree
dispersion: -0.020186661 hartree
dispersion: -0.020189437 hartree
dispersion: -0.020222645 hartree
dispersion: -0.020243051 hartree
dispersion: -0.020291965 hartree
dispersion: -0.020328074 hartree
dispersion: -0.020354485 hartree
dispersion: -0.020349477 hartree
dispersion: -0.020343035 hartree
dispersion: -0.020314064 hartree
dispersion: -0.020271968 hartree
dispersion: -0.020279532 hartree
dispersion: -0.020264348 hartree
dispersion: -0.020294612 hartree
dispersion: -0.020307909 hartree
dispersion: -0.020305632 hartree
dispersion: -0.020308772 hartree
dispersion: -0.020311223 hartree
dispersion: -0.020310998 hartree
dispersion: -0.020309031 hartree
dispersion: -0.020307889 hartree
dispersion: -0.020307813 hartree
chargesum: 1.0000000
charge: -0.084956 -0.100432 0.131488 0.145135 -0.240902 0.076576 0.209583 -0.213365 0.140390 0.150464 0.152215 0.100326 0.130725 0.123318 0.122175 0.157261
charge: 0.091832 0.087366 0.061990 0.049574 0.044978 0.190957 0.062899 0.067002 0.044058 0.050638 0.046441 0.026062 0.034052 0.030096 0.041788 0.070267
qa: -0.0850 -0.1004 0.1315 0.1451 -0.2409 0.0766 0.2096 -0.2134 0.1404 0.1505 0.1522 0.1003 0.1307 0.1233 0.1222 0.1573
va: 3.8905 3.8684 0.9944 1.0035 3.9551 3.6156 0.9686 3.9541 1.0005 1.0130 1.0069 0.9988 0.9991 0.9956 1.0035 0.9919
dispersion: -0.020307835 hartree
energy: -197.034829843682 hartree
dipole: -1.15447 1.58331 0.42884 -0.28099 -0.10357 -0.38456 -0.56011 0.65772 0.09762
magnitude: 0.58423 au
magnitude: 1.48499 debye
quadrupole: 265.85427 -282.28248 -16.42820 172.08874 -189.63225 -17.54351 47.15221 -67.58644 -20.43423 -144.26788 141.01930 -3.24858 -4.51202 4.63147 0.11946 13.66900 -13.92817 -0.25917
zeropoint: 0.14896571 hartree
thermalvibcorrection: 0.00409559 hartree
thermalrotcorrection: 0.00141627 hartree
thermaltrasncorrection: 0.00141627 hartree
thermaltotal: -196.87893600 hartree
thermalcorr: 0.00692813 hartree
nonthermalcorr: 0.14896571 hartree
totalcorr: 0.15589384 hartree
totalenthalpy: -196.87799179 hartree
vibrat: 0.00689808 hartree
rotat: 0.01225232 hartree
total: 0.03753944 hartree
