program: Orca
programVersion: 5.0.4
elementType: C C H H C C H C H H H H H H C H H H H O H H
charge: 1
multiplicity: 1
keywords: wB97X-D3BJ Opt Freq def2-TZVPP def2/J RIJCOSX VeryTightSCF
keywords: PAL8 defgrid3 VeryTightOpt
frequency: 0.00 0.00 0.00 0.00 0.00 0.00 23.96 49.75 66.11 115.95 123.43 144.32 151.99 204.75 241.79 262.25 279.69 307.72 350.32 436.86 442.78 624.64 748.80 835.45 860.56 927.01 970.68 978.18 1033.22 1062.56 1075.96 1129.30 1149.23 1203.68 1237.26 1268.10 1290.74 1331.88 1350.29 1389.77 1398.18 1435.24 1436.94 1463.03 1472.78 1499.44 1506.40 1508.23 1511.12 1575.86 1658.37 2964.43 3039.74 3066.30 3085.13 3123.93 3130.26 3142.83 3143.38 3154.65 3156.90 3161.83 3187.96 3249.15 3847.45 3934.02
frequency: 23.96 49.75 66.11 115.95 123.43 144.32 151.99 204.75 241.79 262.25 279.69 307.72 350.32 436.86 442.78 624.64 748.80 835.45 860.56 927.01 970.68 978.18 1033.22 1062.56 1075.96 1129.30 1149.23 1203.68 1237.26 1268.10 1290.74 1331.88 1350.29 1389.77 1398.18 1435.24 1436.94 1463.03 1472.78 1499.44 1506.40 1508.23 1511.12 1575.86 1658.37 2964.43 3039.74 3066.30 3085.13 3123.93 3130.26 3142.83 3143.38 3154.65 3156.90 3161.83 3187.96 3249.15 3847.45 3934.02
formula: C6H15O
InChI: InChI=1/C6H13.H2O/c1-3-5-6-4-2;/h3H,4-6H2,1-2H3;1H2
22 atoms
C  -6.834461 1.045718 -0.270879
C  -5.304345 1.412117 0.144069
H  -7.160709 0.029018 0.021428
H  -6.838726 1.031963 -1.359686
C  -7.801738 2.030337 0.385743
C  -5.286582 0.053422 0.528798
H  -5.632701 -0.179628 1.536729
C  -4.795501 -1.037394 -0.330631
H  -5.386642 -1.947501 -0.232735
H  -3.796093 -1.268259 0.066786
H  -4.681369 -0.741888 -1.37269
H  -5.325147 2.150865 0.936715
H  -4.731871 1.698091 -0.731118
H  -7.688076 1.960038 1.469626
C  -9.241441 1.732126 -0.020996
H  -7.518219 3.042287 0.08804
H  -9.547904 0.735904 0.306801
H  -9.370579 1.789772 -1.103746
H  -9.918112 2.456121 0.433274
O  -6.797645 0.128432 3.256786
H  -6.451805 0.54784 4.049438
H  -7.496655 -0.450752 3.572298
totalener: -312.85667312 hartree
nucrepener: 323.66964015 hartree
electener: -636.52631328 hartree
oneelecener: -1052.60061893 hartree
twoeener: 416.07430565 hartree
kineticenergy: 311.30105425 hartree
exchangeener: -29.382539327959 hartree
correlationener: -2.322501569590 hartree
xcener: -31.705040897549 hartree
dispersion: -0.028121514 hartree
temp: 298.15 k
press: 1.00 atm
thermalcorrenthalpy: 0.00094421 hartree
totalenthalpy: -312.66990372 hartree
vibrat: 0.01513619 hartree
rotat: 0.01371697 hartree
transl: 0.01891565 hartree
total: 0.04776881 hartree
totalentropycorr: -0.04776881 hartree
gibbsenthalpy: -312.71767253 hartree
gibbsminuselec: 0.16712211 hartree
dispersion: -0.028096003 hartree
dispersion: -0.028055639 hartree
dispersion: -0.028068282 hartree
dispersion: -0.028074733 hartree
dispersion: -0.028080287 hartree
dispersion: -0.028075358 hartree
dispersion: -0.028062834 hartree
dispersion: -0.028029168 hartree
dispersion: -0.027996102 hartree
dispersion: -0.027958584 hartree
dispersion: -0.027902143 hartree
dispersion: -0.027855987 hartree
dispersion: -0.027818252 hartree
dispersion: -0.027799905 hartree
dispersion: -0.027788645 hartree
dispersion: -0.027786966 hartree
dispersion: -0.027784083 hartree
dispersion: -0.027788748 hartree
dispersion: -0.027791521 hartree
dispersion: -0.027798196 hartree
dispersion: -0.027808430 hartree
dispersion: -0.027820677 hartree
dispersion: -0.027832893 hartree
dispersion: -0.027854690 hartree
dispersion: -0.027856675 hartree
dispersion: -0.027857131 hartree
dispersion: -0.027856431 hartree
chargesum: 1.0000000
charge: -0.088751 -0.119045 0.118967 0.139174 -0.116479 0.077622 0.215851 -0.210037 0.136970 0.152981 0.116826 0.140259 0.151797 0.080816 -0.255868 0.105381 0.084796 0.098750 0.116150 -0.439423 0.247566 0.245698
charge: 0.092231 0.077867 0.061791 0.044475 -0.021190 0.196690 0.035293 0.061891 0.042144 0.067327 0.038926 0.048465 0.044090 0.024039 0.023869 0.030136 0.014751 0.018611 0.025173 0.300150 -0.113145 -0.113582
qa: -0.0888 -0.1190 0.1190 0.1392 -0.1165 0.0776 0.2159 -0.2100 0.1370 0.1530 0.1168 0.1403 0.1518 0.0808 -0.2559 0.1054 0.0848 0.0987 0.1162 -0.4394 0.2476 0.2457
va: 3.8544 3.9043 1.0048 1.0099 3.8972 3.4746 1.0382 3.9586 1.0008 0.9932 1.0041 1.0178 1.0081 1.0308 3.9486 0.9982 1.0035 1.0010 1.0032 2.0689 1.0090 1.0098
dispersion: -0.027856450 hartree
energy: -312.886360427388 hartree
dipole: -2.15918 3.14325 0.98407 -0.17608 -0.46569 -0.64177 -1.63148 1.83874 0.20726
magnitude: 1.19298 au
magnitude: 3.03232 debye
quadrupole: 502.60564 -526.06773 -23.46210 264.35784 -290.51487 -26.15703 380.87002 -400.54086 -19.67083 -227.23220 224.31805 -2.91415 -31.64364 28.76285 -2.88079 -48.38278 47.37063 -1.01216
zeropoint: 0.20166915 hartree
thermalvibcorrection: 0.00927341 hartree
thermalrotcorrection: 0.00141627 hartree
thermaltrasncorrection: 0.00141627 hartree
thermaltotal: -312.67258532 hartree
thermalcorr: 0.01210595 hartree
nonthermalcorr: 0.20166915 hartree
totalcorr: 0.21377510 hartree
totalenthalpy: -312.67164111 hartree
vibrat: 0.01703962 hartree
rotat: 0.01375113 hartree
total: 0.04970640 hartree
