program: Orca
programVersion: 5.0.4
elementType: C C H H C C H C H H H H H H C H H H H O H H
charge: 1
multiplicity: 1
keywords: wB97X-D3BJ OptTS Freq def2-TZVPP def2/J RIJCOSX VeryTightSCF
keywords: PAL8 defgrid3 VeryTightOpt
frequency: 0.00 0.00 0.00 0.00 0.00 0.00 -337.63 44.87 64.95 76.55 92.84 127.82 135.82 229.49 244.42 262.78 341.38 362.58 397.11 438.14 466.17 693.08 744.16 810.75 920.61 924.87 958.56 1022.68 1051.44 1078.17 1090.15 1144.97 1170.72 1205.66 1244.46 1271.26 1294.21 1326.39 1338.92 1349.97 1369.57 1424.94 1436.30 1457.68 1483.00 1497.87 1504.59 1509.25 1519.04 1579.36 1651.44 2314.81 3044.05 3055.55 3063.60 3066.49 3077.57 3097.54 3118.75 3133.87 3149.82 3173.43 3177.31 3290.12 3837.86 3927.66
frequency: 44.87 64.95 76.55 92.84 127.82 135.82 229.49 244.42 262.78 341.38 362.58 397.11 438.14 466.17 693.08 744.16 810.75 920.61 924.87 958.56 1022.68 1051.44 1078.17 1090.15 1144.97 1170.72 1205.66 1244.46 1271.26 1294.21 1326.39 1338.92 1349.97 1369.57 1424.94 1436.30 1457.68 1483.00 1497.87 1504.59 1509.25 1519.04 1579.36 1651.44 2314.81 3044.05 3055.55 3063.60 3066.49 3077.57 3097.54 3118.75 3133.87 3149.82 3173.43 3177.31 3290.12 3837.86 3927.66
formula: C6H15O
InChI: InChI=1/C6H13.H2O/c1-3-5-6-4-2;/h1,3-6H2,2H3;1H2
22 atoms
C  -7.275657 0.719489 -0.074017
C  -5.771962 0.836936 -0.330589
H  -7.448058 0.106626 0.81816
H  -7.749321 0.195801 -0.911208
C  -7.932802 2.085237 0.112236
C  -5.116827 -0.488814 -0.597531
H  -5.16251 -1.199913 0.404673
C  -3.850753 -0.837792 -0.139431
H  -5.549745 -1.119311 -1.372354
H  -3.406749 -1.78986 -0.406176
H  -3.376273 -0.251333 0.639487
H  -5.269763 1.342582 0.498586
H  -5.591093 1.440125 -1.227045
H  -7.447622 2.608964 0.942238
C  -9.43077 1.971826 0.377509
H  -7.758541 2.691467 -0.78251
H  -9.627173 1.393794 1.283664
H  -9.940718 1.478123 -0.453091
H  -9.880457 2.956763 0.506662
O  -2.298143 0.15441 -1.555239
H  -1.932406 -0.259571 -2.342433
H  -1.672736 0.84231 -1.309258
totalener: -312.81538309 hartree
nucrepener: 309.35216195 hartree
electener: -622.16754504 hartree
oneelecener: -1024.48439753 hartree
twoeener: 402.31685248 hartree
kineticenergy: 311.31327125 hartree
exchangeener: -29.381912689359 hartree
correlationener: -2.320388641622 hartree
xcener: -31.702301330982 hartree
dispersion: -0.026672281 hartree
temp: 298.15 k
press: 1.00 atm
thermalcorrenthalpy: 0.00094421 hartree
totalenthalpy: -312.63107136 hartree
vibrat: 0.01104844 hartree
rotat: 0.01375490 hartree
transl: 0.01891565 hartree
total: 0.04371899 hartree
totalentropycorr: -0.04371899 hartree
gibbsenthalpy: -312.67479035 hartree
gibbsminuselec: 0.16726502 hartree
dispersion: -0.026550822 hartree
dispersion: -0.026702876 hartree
dispersion: -0.026718543 hartree
dispersion: -0.026771032 hartree
dispersion: -0.026667951 hartree
dispersion: -0.026577670 hartree
dispersion: -0.026454694 hartree
dispersion: -0.026584589 hartree
dispersion: -0.026653611 hartree
dispersion: -0.026688962 hartree
dispersion: -0.026738263 hartree
dispersion: -0.026762013 hartree
dispersion: -0.026682875 hartree
dispersion: -0.026754075 hartree
dispersion: -0.026780399 hartree
dispersion: -0.026790625 hartree
dispersion: -0.026778278 hartree
dispersion: -0.026778313 hartree
dispersion: -0.026781412 hartree
dispersion: -0.026854412 hartree
dispersion: -0.026793152 hartree
dispersion: -0.026793340 hartree
dispersion: -0.026794288 hartree
dispersion: -0.026795730 hartree
dispersion: -0.026796013 hartree
dispersion: -0.026796253 hartree
dispersion: -0.026796423 hartree
dispersion: -0.026796623 hartree
dispersion: -0.026796798 hartree
dispersion: -0.026796949 hartree
dispersion: -0.026797074 hartree
dispersion: -0.026797190 hartree
dispersion: -0.026797273 hartree
dispersion: -0.026797350 hartree
dispersion: -0.026797429 hartree
chargesum: 1.0000000
charge: -0.128040 -0.127630 0.078067 0.089197 -0.115331 0.029328 0.173030 -0.066822 0.181102 0.219581 0.200843 0.089896 0.116038 0.073694 -0.256972 0.076909 0.083651 0.085484 0.106746 -0.419892 0.255518 0.255602
charge: -0.023748 -0.000431 0.022553 0.026130 -0.035196 0.066244 0.186079 0.252774 0.062304 0.052510 0.052439 0.035808 0.049331 0.019843 0.013511 0.020923 0.013249 0.013769 0.018052 0.354827 -0.100421 -0.100548
qa: -0.1280 -0.1276 0.0781 0.0892 -0.1153 0.0293 0.1730 -0.0668 0.1811 0.2196 0.2008 0.0899 0.1160 0.0737 -0.2570 0.0769 0.0837 0.0855 0.1067 -0.4199 0.2555 0.2556
va: 3.8629 3.8943 1.0121 1.0090 3.9099 3.7352 0.9899 3.7380 0.9901 0.9764 0.9803 1.0114 1.0123 1.0030 3.9557 1.0044 1.0016 1.0017 1.0036 2.0941 1.0004 0.9999
dispersion: -0.026797487 hartree
energy: -312.864162774905 hartree
dipole: -3.94213 6.88622 2.94409 0.99040 -2.65123 -1.66083 1.47239 -1.78195 -0.30956
magnitude: 3.39439 au
magnitude: 8.62784 debye
quadrupole: 1245.66721 -1253.57667 -7.90947 273.01158 -297.76976 -24.75818 118.20897 -146.58280 -28.37383 -416.94654 409.99870 -6.94784 -274.43297 269.32136 -5.11161 71.59528 -70.66037 0.93491
zeropoint: 0.20022228 hartree
thermalvibcorrection: 0.00829133 hartree
thermalrotcorrection: 0.00141627 hartree
thermaltrasncorrection: 0.00141627 hartree
thermaltotal: -312.65281662 hartree
thermalcorr: 0.01112387 hartree
nonthermalcorr: 0.20022228 hartree
totalcorr: 0.21134615 hartree
totalenthalpy: -312.65187241 hartree
vibrat: 0.01493560 hartree
rotat: 0.01374196 hartree
total: 0.04759322 hartree
